BMW · Mini · Rolls-Royce — fault codes starting with 01

954 fault codes starting with 01 on BMW · Mini · Rolls-Royce vehicles, with descriptions: 010000, 010001, 010002 and more. Look up a code, read what it means.

Fault codes
954
Block
01
Make group
BMW · Mini · Rolls-Royce
Source language
English · German

The 954 BMW · Mini · Rolls-Royce fault codes that start with 01, with descriptions.

010

CodeDescriptionGerman
010000System time diagnosis master - reception implausible / no system time receivedSystemzeit Diagnose Master - Empfang unplausibel / keine Systemzeit erhalten
010001COMBO2x_RSC - Info - Combo AccRangeFailureCOMBO2x_RSC - Info - Combo AccRangeFailure
010002Speed - signal incorrectGeschwindigkeit - Signal fehlerhaft
010003COMBO2z_ISC - Info signal RateRangeFailureCOMBO2z_ISC - Info -Signal RateRangeFailure
010004COMBO2z_ISC - Info - Signal AccXRangeFailureCOMBO2z_ISC - Info - Signal AccXRangeFailure
010005COMBO2z_ISC - Info signal AccYRangeFailureCOMBO2z_ISC - Info -Signal AccYRangeFailure
010006COMBO2y_PSC - Info - Sensor CSDP_SELFTEST_FAILED (Initialization failed)COMBO2y_PSC - Info - Sensor CSDP_SELFTEST_FAILED (Initialization failed)
010007COMBO2z_RISC - Info signal Temperature FailureCOMBO2z_RISC - Info -Signal Temperature Failure
010008COMBO2z_RISC - Info -Sensor Component Failure (driver uninit, Combo error, uninted. Reset)COMBO2z_RISC - Info -Sensor Component Failure (driver uninit, Combo error, uninted. Reset)
010009COMBO2y_PSC - Info - Sensor Component Failure (driver uninit, Combo error, uninted. Reset)COMBO2y_PSC - Info - Sensor Component Failure (driver uninit, Combo error, uninted. Reset)
01000ACOMBO2x_RSC - Info - Sensor Component Error (driver uninit, Combo error, uninted. Reset)COMBO2x_RSC - Info - Sensor Component Error (driver uninit, Combo error, uninted. Reset)
01000BFH_t_FC_SAFE_TXD_FAULTFH_t_FC_SAFE_TXD_FAULT
01000CFH_t_FC_CRC_FAIL_DEPLOY_CONFIGFH_t_FC_CRC_FAIL_DEPLOY_CONFIG
01000DCOMBO2z_RISC - Info - Sensor CSDP_SELFTEST_FAILED (Initialization failed)COMBO2z_RISC - Info - Sensor CSDP_SELFTEST_FAILED(Initialization failed)
01000EFH_t_FC_CRC_FAIL_CONF_IASGFH_t_FC_CRC_FAIL_CONF_IASG
01000FLIN - Info - LINIF_E_RESPONSELIN - Info - LINIF_E_RESPONSE
010010LIN - Info - LINIF_E_NC_NO_RESPONSELIN - Info - LINIF_E_NC_NO_RESPONSE
010011LIN - Info - LIN_E_TIMEOUTLIN - Info - LIN_E_TIMEOUT
010012Diagnosis master - info - fault memory blockedDiagnosemaster - Info - Fehlerspeicher gesperrt
010013PIA_E_IO_ERRORPIA_E_IO_ERROR
010014Parkmaster - Info - SW component terminated incorrectlyParkmaster - Info - SW-Komponente fehlerhaft beendet
010015Precrash - Info - SW component terminated incorrectlyPrecrash - Info - SW-Komponente fehlerhaft beendet
010016Seat Belt Reminder - Info - SW component terminated incorrectlySeat Belt Reminder - Info - SW-Komponente fehlerhaft beendet
010017Driver Awareness Condition - Info - SW component terminated incorrectlyDriver Awareness Condition - Info - SW-Komponente fehlerhaft beendet
010018BAC - Info - SW component terminated incorrectlyBAC - Info - SW-Komponente fehlerhaft beendet
010019FGS / HV gSat - Info - Safing Sensor Arming missingFGS/HV gSat - Info - Safing Sensor Arming fehlt
01001AFGS / HV - Info - Safing path blockedFGS/HV - Info - Safing Pfad gesperrt
01001BFGS / HV - Info - Near Deploy Outside Velocity WindowFGS/HV - Info - Near Deploy Outside Velocity Window
01001CPTS-Algo - Info - Vehicle speed timeout on alertPTS-Algo - Info - Fahrzeuggeschwindigkeit Timeout bei Alert
01001DFGS / HV - Info - Temperature information not availableFGS/HV - Info - Temperatur-Information nicht verfügbar
01001ECOMBO2z_ISC - Info - Combo RateRangeFailureCOMBO2z_ISC - Info - Combo RateRangeFailure
01001FCOMBO2z_ISC - Info - Combo AccRangeFailureCOMBO2z_ISC - Info - Combo AccRangeFailure
010020FGS_SB Pedestrian protection sensor - Timeout vehicle speed in case of an alertFGS_SB Fussgaengerschutz-Sensor - Timeout Fahrzeuggeschwindigkeit bei Alert
010021FGS_SB Pedestrian protection sensor - Timeout dynamic data normalFGS_SB Fussgaengerschutz-Sensor - Timeout dynamische Daten Normal
010022FGS_SB Pedestrian Protection Sensor - Timeout dynamic data alertFGS_SB Fussgaengerschutz-Sensor - Timeout dynamische Daten Alert
010023FGS_SB pedestrian protection sensor - timeout static dataFGS_SB Fussgängerschutzsensor - Timeout statische Daten
010024FGS_SB Pedestrian protection sensor - timeout temperatureFGS_SB Fussgaengerschutz-Sensor - Timeout Temperatur
010025FGS_SB Pedestrian protection sensor - offset driftFGS_SB Fussgaengerschutz-Sensor - Offset Drift
010026FGS_SB Pedestrian protection sensor - plausibility dynamic dataFGS_SB Fussgaengerschutz-Sensor - Plausibilitaet dynamische Daten
010027FGS_SB Pedestrian protection sensor - initialization incorrectFGS_SB Fussgaengerschutz-Sensor - Initialisierung fehlerhaft
010028FGS_SB Pedestrian protection sensor - offset adjustment incorrectFGS_SB Fussgaengerschutz-Sensor - Offset Abgleich fehlerhaft
010029FGS_SB Pedestrian protection sensor - Safing Path blockedFGS_SB Fussgaengerschutz-Sensor - Safing Path gesperrt
01002AInfo alert thresholdInfo Alert-Schwelle
01002BFGS_SB pedestrian protection sensor - arming is missingFGS_SB Fussgängerschutzsensor - Arming fehlt
01002CData recorder Data storage not possibleDatenrecorder Datenspeicherung nicht möglich
01002DFGS_Drucksystem - Integrity error sensor leftFGS_Drucksystem - Integritaetsfehler Sensor links
01002EFGS_Drucksystem - Integrity error sensor rightFGS_Drucksystem - Integritaetsfehler Sensor rechts
01002FFGS_Drucksystem - FGS-Algo: Vehicle speed timeoutFGS_Drucksystem - FGS-Algo : Fahrzeuggeschwindigkeit Timeout
010030FGS_Drucksystem - Safing-Path blockedFGS_Drucksystem - Safing-Path gesperrt
010031FGS_Drucksystem - Safing sensor arming is missingFGS_Drucksystem - Safing-Sensor Arming fehlt
010032FGS Near Deploy lowFGS Near Deploy low
010033FGS Near Deploy highFGS Near Deploy high
010034Near Deploy Rollover E-CallNear Deploy Rollover E-Call
010035AECU in autarkyAECU in autarky
010036Info NoAlive MVBAT (KL30B)Info NoAlive MVBAT(KL30B)
010037Info NoAlive VBDIAG (GKEY)Info NoAlive VBDIAG(GKEY)
010038Trigger Rollover eCall - sentTrigger Rollover eCall - gesendet

011

CodeDescriptionGerman
011000Firing ASIC1 (SF1, SF2): ZK1 ZK13 Interruption of the power supplyFiring ASIC1 (SF1, SF2): ZK1 ZK13 Unterbrechung der Spannungsversorgung
011001Signal (Zeit_Sekunde_Zaehler_Relativ, 0x328): invalidSignal (Zeit_Sekunde_Zaehler_Relativ, 0x328): ungültig
011002Flexray - Info - TranceiverErrorFlexray - Info - TranceiverError
011003Firing ASIC4 (SF1, SF2): ZK29 ZK30 Interruption of the power supplyFiring ASIC4 (SF1, SF2): ZK29 ZK30 Unterbrechung der Spannungsversorgung
011004Microcontroller - Software - ECUM_E_ALL_RUN_REQUESTS_KILLEDMicrocontroller - Software - ECUM_E_ALL_RUN_REQUESTS_KILLED
011005Firing ASIC2 (SF3, SF4): ZK2 ZK5 Interruption of the power supplyFiring ASIC2 (SF3, SF4): ZK2 ZK5 Unterbrechung der Spannungsversorgung
011006Firing ASIC3 (SF3, SF4): ZK20 ZK11 Interruption of the power supplyFiring ASIC3 (SF3, SF4): ZK20 ZK11 Unterbrechung der Spannungsversorgung
011007Firing ASIC4 (SF3, SF4): ZK31 ZK32 Interruption of the power supplyFiring ASIC4 (SF3, SF4): ZK31 ZK32 Unterbrechung der Spannungsversorgung
011008Firing ASIC1 (SF5, SF6): ZK17 ZK7 Interruption of the power supplyFiring ASIC1 (SF5, SF6): ZK17 ZK7 Unterbrechung der Spannungsversorgung
011009EEPROM - NVM - NVM_E_QUEUE_OVERFLOWEEPROM - NVM - NVM_E_QUEUE_OVERFLOW
01100AEEPROM - NVM - NVM_E_WRITE_PROTECTEDEEPROM - NVM - NVM_E_WRITE_PROTECTED
01100BEEPROM - NVM - NVM_E_REQ_FAILEDEEPROM - NVM - NVM_E_REQ_FAILED
01100CEEPROM - NVM - NVM_E_INTEGRITY_FAILEDEEPROM - NVM - NVM_E_INTEGRITY_FAILED
01100DEEPROM - NVM - NVM_E_WRONG_BLOCK_IDEEPROM - NVM - NVM_E_WRONG_BLOCK_ID
01100EEEPROM - NVM - NVM_E_LOSS_OF_REDUNDANCYEEPROM - NVM - NVM_E_LOSS_OF_REDUNDANCY
01100FEEPROM - NVM - NVM_E_VERIFY_FAILEDEEPROM - NVM - NVM_E_VERIFY_FAILED
011010Firing ASIC1: power supply faultFiring ASIC1: Spannungsversorgungsfehler
011011Microcontroller - Software - MCU_E_CLOCK_FAILUREMicrocontroller - Software - MCU_E_CLOCK_FAILURE
011012Microcontroller - Software - MCU_E_TIMEOUT_TRANSITIONMicrocontroller - Software - MCU_E_TIMEOUT_TRANSITION
011013Microcontroller - Software - MCU_E_QUARTZ_FAILUREMicrocontroller - Software - MCU_E_QUARTZ_FAILURE
011014Microcontroller - Software - MCU_E_LOCK_FAILUREMicrocontroller - Software - MCU_E_LOCK_FAILURE
011015Damage detection info: SW component ended with errorsDamage Detection-Info: SW-Kompnente fehlerhaft beendet
011019Microcontroller - software - exceptionMicrocontroller - Software - Exception
01101APower supply Hall sensors: errorSpannungsversorgung Hall-Sensoren: Fehler
01101BMicrocontroller software resetMicrocontroller - Software - Reset
01101CMicrocontroller - ROM - ECC FailureMicrocontroller - ROM - ECC Failure
01101DMicrocontroller - RAM - ECC FailureMicrocontroller - RAM - ECC Failure
01101EMicrocontroller - ROM - CRC FailureMicrocontroller - ROM - CRC Failure
01101FMicrocontroller - RAM - CRC FailureMicrocontroller - RAM - CRC Failure
011020V buck out of range (operational range)Vbuck out of range (operational range)
011021Vsnych out of range (operational range)Vsnych out of range (operational range)
011022SYC - Power Supply - Internal Voltage FaultSYC - Power Supply - Internal Voltage Fault
011023SYC - Firing Loops - Reference Squib FaultSYC - Firing Loops - Reference Squib Fault
011024SYC - Power Supply - VZ Voltage too lowSYC - Power Supply - VZ Voltage too low
011025EXC_1 -Power Supply -Internal Voltage FaultEXC_1 -Power Supply -Internal Voltage Fault
011026EXC_1 - Firing Loops - Reference Squib FaultEXC_1 - Firing Loops - Reference Squib Fault
011027EXC_1 -Power Supply -VZ Voltage too lowEXC_1 -Power Supply -VZ Voltage too low
011028EXC_2 -Power Supply - Internal Voltage FaultEXC_2 -Power Supply - Internal Voltage Fault
011029EXC_2 - Firing Loops -Reference Squib FaultEXC_2 - Firing Loops -Reference Squib Fault
01102AEXC_2 -Power Supply -VZ Voltage too lowEXC_2 -Power Supply -VZ Voltage too low
01102BEXC_3 - Power Supply - Internal Voltage FaultEXC_3 - Power Supply - Internal Voltage Fault
01102CEXC_3 -Firing Loops -Reference Squib FaultEXC_3 -Firing Loops -Reference Squib Fault
01102DEXC_3 - Power Supply - VZ Voltage too lowEXC_3 - Power Supply - VZ Voltage too low
01102EMicrocontroller - VCOREMicrocontroller - VCORE
01102FEnergy Reserve - Capacitor - Capacity Measurement FaultEnergy Reserve - Capacitor - Capacity Measurement Fault
011030Energy Reserve - Autarky - Autonomous Operation Time FaultEnergy Reserve - Autarky - Autonomous Operation Time Fault
011031Microcontroller - ROM - CRC FailureMicocontroller - ROM- CRC Failure
011032Micocontroller - ROM - CFG Limits CRC FailureMicocontroller - ROM - CFG Limits CRC Failure
011033Firing ASIC3: remains in reset during startupFiring ASIC3: bleibt in Reset während Startup
011034Firing ASIC4: remains in reset during startupFiring ASIC4: bleibt in Reset während Startup
011035Firing ASIC1: Reset during the active phase (after ASIC Init)Firing ASIC1: Reset während der aktiv Phase (nach ASIC Init)
011036IASG - ST- SWI_REF_FAULT_SYCIASG - ST- SWI_REF_FAULT_SYC
011037IASG - ST - HAL_IASG_MUX_FAULTIASG - ST - HAL_IASG_MUX_FAULT
011038Firing ASIC4: Reset during the active phase (after ASIC Init)Firing ASIC4: Reset während der aktiv Phase (nach ASIC Init)
011039COMBO2x_RSC - Roll rate - SAFING ERRORCOMBO2x_RSC - Rollrate - SAFING ERROR
01103AFiring ASIC2: Error at LowSide VrefFiring ASIC2: Fehler bei LowSide Vref
01103BCOMBO2x_RSC - Sensor - Configuration Fault (wrong: ID, sensor, operationmode)COMBO2x_RSC - Sensor - Configuration Fault (wrong: ID, sensor, operationmode)
01103CCOMBO2x_RSC - Sensor - SPI fault (CRC & OPCODE Error)COMBO2x_RSC - Sensor - SPI fault (CRC & OPCODE Error)
01103DCOMBO2x_RSC - Sensor - Component faultCOMBO2x_RSC - Sensor - Component fault
01103ECOMBO2x (Roll) - Signal - Integrity Fault, Roll RateCOMBO2x (Roll) - Signal - Integrity Fault, Roll Rate
01103FCOMBO2x (Roll) - Signal - Integrity Fault, low-gz (Vehicle Z)COMBO2x (Roll) - Signal - Integrity Fault, low-g-z (Vehicle Z)
011040COMBO2x (Roll) - Signal - Integrity Fault, low-gy (Vehicle Y)COMBO2x (Roll) - Signal - Integrity Fault, low-g-y (Vehicle Y)
011041COMBO2z_ISC - Signal - Integrity Fault, low-gx (Vehicle Y; Custom1)COMBO2z_ISC - Signal - Integrity Fault, low-g-x(Vehicle Y; Custom1)
011042Microcontroller - Software - PERM_ABORT_DLMicrocontroller - Software - PERM_ABORT_DL
011043ASGx - Sensor - Config errorASGx - Sensor - Config error
011044ASGx - Signal-Integrity fault,Channel XASGx - Signal -Integrity fault,Channel X
011045ASGx - Signal-Integrity fault,Channel YASGx - Signal -Integrity fault,Channel Y
011046ASGx - Sensor - Configuration mismatchASGx - Sensor - Configuration mismatch
011047ASGx - Sensor - INIT faultASGx - Sensor - INIT fault
011048ASGx - Sensor - COMM faultASGx - Sensor - COMM fault
011049ASG sensor - clock counter faultASG sensor - clock counter fault
01104AASGx - Sensor -CHANNEL0 test faultASGx - Sensor -CHANNEL0 test fault
01104BASGx - Sensor - CHANNEL1 test faultASGx - Sensor - CHANNEL1 test fault
01104CASGx - Sensor-Safing pathASGx - Sensor -Safing path
01104DCombo3z: Init FailureCombo3z: Init Failure
01104FSYC - Firing Loops - Squib Configuration FaultSYC - Firing Loops - Squib Configuration Fault
011050EXC_1 - Firing Loops - Squib Configuration FaultEXC_1 - Firing Loops - Squib Configuration Fault
011051EXC_2 - Firing Loops -Squib Configuration FaultEXC_2 - Firing Loops -Squib Configuration Fault
011052EXC_3 - Firing Loops - Squib Configuration FaultEXC_3 - Firing Loops - Squib Configuration Fault
011053SYC - Safing - VSGC FaultSYC - Safing - VSGC Fault
011054SYC - Safing - VZ3 Sink FaultSYC - Safing - VZ3 Sink Fault
011055ST - Safing - Safing Transistor FaultST - Safing - Safing Transistor Fault
011056ST - Safing - ARMQ_SAT_FAULTST - Safing - ARMQ_SAT_FAULT
011057SYC - Safing - HSENx FaultSYC - Safing - HSENx Fault
011058Microcontroller - Safing - LSENQ FaultMicrocontroller - Safing - LSENQ Fault
011059Microcontroller - Safing - ARMX_FaultMicrocontroller - Safing - ARMX_Fault
01105ASYC - Safing - TESTMQ FaultSYC - Safing - TESTMQ Fault
01105BMicrocontroller ports - cross-coupling portsMicrocontroller - Ports - Crosscoupling Ports
01105CASIC - SAT - SPI communication errorASIC - SAT- SPI communication error
01105DZK17: High-side transistor error in the activation testZK17: High-Side-Transistor Fehler im Aktivierungstest
01105EZK7: High-side transistor error in the activation testZK7: High-Side-Transistor Fehler im Aktivierungstest
01105FZK4: High-side transistor error in the activation testZK4: High-Side-Transistor Fehler im Aktivierungstest
011060ZK14: High-side transistor error in the activation testZK14: High-Side-Transistor Fehler im Aktivierungstest
011061ZK19: High-side transistor error in the activation testZK19: High-Side-Transistor Fehler im Aktivierungstest
011062ZK8: High-side transistor error in the activation testZK8: High-Side-Transistor Fehler im Aktivierungstest
011063ZK2: High-side transistor error in the activation testZK2: High-Side-Transistor Fehler im Aktivierungstest
011064ZK5: High-side transistor error in the activation testZK5: High-Side-Transistor Fehler im Aktivierungstest
011065ZK23: High-side transistor error in the activation testZK23: High-Side-Transistor Fehler im Aktivierungstest
011066ZK15: High-side transistor error in the activation testZK15: High-Side-Transistor Fehler im Aktivierungstest
011067ZK21: High-side transistor error in the activation testZK21: High-Side-Transistor Fehler im Aktivierungstest
011068ZK9: High-side transistor error in the activation testZK9: High-Side-Transistor Fehler im Aktivierungstest
011069ZK18: High-side transistor error in the activation testZK18: High-Side-Transistor Fehler im Aktivierungstest
01106AZK10: High-side transistor error in the activation testZK10: High-Side-Transistor Fehler im Aktivierungstest
01106BZK20: High-side transistor error in the activation testZK20: High-Side-Transistor Fehler im Aktivierungstest
01106CZK11: High-side transistor error in the activation testZK11: High-Side-Transistor Fehler im Aktivierungstest
01106DZK24: High-side transistor error in the activation testZK24: High-Side-Transistor Fehler im Aktivierungstest
01106EZK16: High-side transistor error in the activation testZK16: High-Side-Transistor Fehler im Aktivierungstest
01106FZK22: High-side transistor error in the activation testZK22: High-Side-Transistor Fehler im Aktivierungstest
011070ZK12: High-side transistor error in the activation testZK12: High-Side-Transistor Fehler im Aktivierungstest
011071ZK29: High-side transistor error in the activation testZK29: High-Side-Transistor Fehler im Aktivierungstest
011072ZK30: High-side transistor error in the activation testZK30: High-Side-Transistor Fehler im Aktivierungstest
011073ZK31: High-side transistor error in the activation testZK31: High-Side-Transistor Fehler im Aktivierungstest
011074ZK32: High-side transistor error in the activation testZK32: High-Side-Transistor Fehler im Aktivierungstest
011075ZK28: High-side transistor error in the activation testZK28: High-Side-Transistor Fehler im Aktivierungstest
011076ZK27: High-side transistor error in the activation testZK27: High-Side-Transistor Fehler im Aktivierungstest
011077ZK26: High-side transistor error in the activation testZK26: High-Side-Transistor Fehler im Aktivierungstest
011078ZK25: High-side transistor error in the activation testZK25: High-Side-Transistor Fehler im Aktivierungstest
011079ZK1: high-side transistor test: wrong activation timesZK1: High-Side-Transistortest: falsche Aktivierungszeiten
01107AZK13: High-side transistor test: wrong activation timesZK13: High-Side-Transistortest: falsche Aktivierungszeiten
01107BZK3: high-side transistor test: wrong activation timesZK3: High-Side-Transistortest: falsche Aktivierungszeiten
01107CZK6: high-side transistor test: incorrect activation timesZK6: High-Side-Transistortest: falsche Aktivierungszeiten
01107DZK17: high-side transistor test: wrong activation timesZK17: High-Side-Transistortest: falsche Aktivierungszeiten
01107EZK7: high-side transistor test: wrong activation timesZK7: High-Side-Transistortest: falsche Aktivierungszeiten
01107FZK4: high-side transistor test: wrong activation timesZK4: High-Side-Transistortest: falsche Aktivierungszeiten
011080ZK14: high-side transistor test: wrong activation timesZK14: High-Side-Transistortest: falsche Aktivierungszeiten
011081ZK19: high-side transistor test: wrong activation timesZK19: High-Side-Transistortest: falsche Aktivierungszeiten
011082ZK8: high-side transistor test: wrong activation timesZK8: High-Side-Transistortest: falsche Aktivierungszeiten
011083ZK2: high-side transistor test: wrong activation timesZK2: High-Side-Transistortest: falsche Aktivierungszeiten
011084ZK5: high-side transistor test: wrong activation timesZK5: High-Side-Transistortest: falsche Aktivierungszeiten
011085ZK23: high-side transistor test: wrong activation timesZK23: High-Side-Transistortest: falsche Aktivierungszeiten
011086ZK15: high-side transistor test: wrong activation timesZK15: High-Side-Transistortest: falsche Aktivierungszeiten
011087ZK21: high-side transistor test: wrong activation timesZK21: High-Side-Transistortest: falsche Aktivierungszeiten
011088ZK9: high-side transistor test: wrong activation timesZK9: High-Side-Transistortest: falsche Aktivierungszeiten
011089ZK18: high-side transistor test: incorrect activation timesZK18: High-Side-Transistortest: falsche Aktivierungszeiten
01108AZK10: high-side transistor test: wrong activation timesZK10: High-Side-Transistortest: falsche Aktivierungszeiten
01108BZK20: high-side transistor test: wrong activation timesZK20: High-Side-Transistortest: falsche Aktivierungszeiten
01108CZK11: high-side transistor test: wrong activation timesZK11: High-Side-Transistortest: falsche Aktivierungszeiten
01108DZK24: high-side transistor test: wrong activation timesZK24: High-Side-Transistortest: falsche Aktivierungszeiten
01108EZK16: high-side transistor test: wrong activation timesZK16: High-Side-Transistortest: falsche Aktivierungszeiten
01108FZK22: high-side transistor test: wrong activation timesZK22: High-Side-Transistortest: falsche Aktivierungszeiten
011090ZK12: high-side transistor test: wrong activation timesZK12: High-Side-Transistortest: falsche Aktivierungszeiten
011091ZK29: high-side transistor test: wrong activation timesZK29: High-Side-Transistortest: falsche Aktivierungszeiten
011092ZK30: high-side transistor test: wrong activation timesZK30: High-Side-Transistortest: falsche Aktivierungszeiten
011093ZK31: high-side transistor test: wrong activation timesZK31: High-Side-Transistortest: falsche Aktivierungszeiten
011094ZK32: high-side transistor test: wrong activation timesZK32: High-Side-Transistortest: falsche Aktivierungszeiten
011095ZK28: high-side transistor test: wrong activation timesZK28: High-Side-Transistortest: falsche Aktivierungszeiten
011096ZK27: high-side transistor test: wrong activation timesZK27: High-Side-Transistortest: falsche Aktivierungszeiten
011097ZK26: High-side transistor test: incorrect activation timesZK26: High-Side-Transistortest: falsche Aktivierungszeiten
011098ZK25: high-side transistor test: wrong activation timesZK25: High-Side-Transistortest: falsche Aktivierungszeiten
011099ZK1: Low-side transistor test: activation errorZK1: Low-Side-Transistortest: Aktivierungsfehler
01109AZK13: Low-side transistor test: activation errorZK13: Low-Side-Transistortest: Aktivierungsfehler
01109BZK3: Low-side transistor test: activation errorZK3: Low-Side-Transistortest: Aktivierungsfehler
01109CZK6: Low-side transistor test: activation errorZK6: Low-Side-Transistortest: Aktivierungsfehler
01109DZK17: Low-side transistor test: activation errorZK17: Low-Side-Transistortest: Aktivierungsfehler
01109EZK7: Low-side transistor test: activation errorZK7: Low-Side-Transistortest: Aktivierungsfehler
01109FZK4: Low-side transistor test: activation errorZK4: Low-Side-Transistortest: Aktivierungsfehler
0110A0ZK14: Low-side transistor test: activation errorZK14: Low-Side-Transistortest: Aktivierungsfehler
0110A1ZK19: Low-side transistor test: activation errorZK19: Low-Side-Transistortest: Aktivierungsfehler
0110A2ZK8: Low-side transistor test: activation errorZK8: Low-Side-Transistortest: Aktivierungsfehler
0110A3ZK2: Low-side transistor test: activation errorZK2: Low-Side-Transistortest: Aktivierungsfehler
0110A4ZK5: Low-side transistor test: activation errorZK5: Low-Side-Transistortest: Aktivierungsfehler
0110A5ZK23: Low-side transistor test: activation errorZK23: Low-Side-Transistortest: Aktivierungsfehler
0110A6ZK15: Low-side transistor test: activation errorZK15: Low-Side-Transistortest: Aktivierungsfehler
0110A7ZK21: Low-side transistor test: activation errorZK21: Low-Side-Transistortest: Aktivierungsfehler
0110A8ZK9: Low-side transistor test: activation errorZK9: Low-Side-Transistortest: Aktivierungsfehler
0110A9ZK18: Low-side transistor test: activation errorZK18: Low-Side-Transistortest: Aktivierungsfehler
0110AAZK10: Low-side transistor test: activation errorZK10: Low-Side-Transistortest: Aktivierungsfehler
0110ABZK20: Low-side transistor test: activation errorZK20: Low-Side-Transistortest: Aktivierungsfehler
0110ACZK11: Low-side transistor test: activation errorZK11: Low-Side-Transistortest: Aktivierungsfehler
0110ADZK24: Low-side transistor test: activation errorZK24: Low-Side-Transistortest: Aktivierungsfehler
0110AEZK16: Low-side transistor test: activation errorZK16: Low-Side-Transistortest: Aktivierungsfehler
0110AFZK22: Low-side transistor test: activation errorZK22: Low-Side-Transistortest: Aktivierungsfehler
0110B0ZK12: Low-side transistor test: activation errorZK12: Low-Side-Transistortest: Aktivierungsfehler
0110B1ZK29: Low-side transistor test: activation errorZK29: Low-Side-Transistortest: Aktivierungsfehler
0110B2ZK30: Low-side transistor test: activation errorZK30: Low-Side-Transistortest: Aktivierungsfehler
0110B3ZK31: Low-side transistor test: activation errorZK31: Low-Side-Transistortest: Aktivierungsfehler
0110B4ZK32: Low-side transistor test: activation errorZK32: Low-Side-Transistortest: Aktivierungsfehler
0110B5ZK28: Low-side transistor test: activation errorZK28: Low-Side-Transistortest: Aktivierungsfehler
0110B6ZK27: Low-side transistor test: activation errorZK27: Low-Side-Transistortest: Aktivierungsfehler
0110B7ZK26: Low-side transistor test: activation errorZK26: Low-Side-Transistortest: Aktivierungsfehler
0110B8ZK25: Low-side transistor test: activation errorZK25: Low-Side-Transistortest: Aktivierungsfehler
0110B9ZK1: Low-side transistor test: deactivation errorZK1: Low-Side-Transistortest: Deaktivierungsfehler
0110BAZK13: Low-side transistor test: deactivation errorZK13: Low-Side-Transistortest: Deaktivierungsfehler
0110BBZK3: Low-side transistor test: deactivation errorZK3: Low-Side-Transistortest: Deaktivierungsfehler
0110BCZK6: Low-side transistor test: deactivation errorZK6: Low-Side-Transistortest: Deaktivierungsfehler
0110BDZK17: Low-side transistor test: deactivation errorZK17: Low-Side-Transistortest: Deaktivierungsfehler
0110BEZK7: Low-side transistor test: deactivation errorZK7: Low-Side-Transistortest: Deaktivierungsfehler
0110BFZK4: Low-side transistor test: deactivation errorZK4: Low-Side-Transistortest: Deaktivierungsfehler
0110C0ZK14: Low-side transistor test: deactivation errorZK14: Low-Side-Transistortest: Deaktivierungsfehler
0110C1ZK19: Low-side transistor test: deactivation errorZK19: Low-Side-Transistortest: Deaktivierungsfehler
0110C2ZK8: Low-side transistor test: deactivation errorZK8: Low-Side-Transistortest: Deaktivierungsfehler
0110C3ZK2: Low-side transistor test: deactivation errorZK2: Low-Side-Transistortest: Deaktivierungsfehler
0110C4ZK5: Low-side transistor test: deactivation errorZK5: Low-Side-Transistortest: Deaktivierungsfehler
0110C5ZK23: Low-side transistor test: deactivation errorZK23: Low-Side-Transistortest: Deaktivierungsfehler
0110C6ZK15: Low-side transistor test: deactivation errorZK15: Low-Side-Transistortest: Deaktivierungsfehler
0110C7ZK21: Low-side transistor test: deactivation errorZK21: Low-Side-Transistortest: Deaktivierungsfehler
0110C8ZK9: Low-side transistor test: deactivation errorZK9: Low-Side-Transistortest: Deaktivierungsfehler
0110C9ZK18: Low-side transistor test: deactivation errorZK18: Low-Side-Transistortest: Deaktivierungsfehler
0110CAZK10: Low-side transistor test: deactivation errorZK10: Low-Side-Transistortest: Deaktivierungsfehler
0110CBZK20: Low-side transistor test: deactivation errorZK20: Low-Side-Transistortest: Deaktivierungsfehler
0110CCZK11: Low-side transistor test: deactivation errorZK11: Low-Side-Transistortest: Deaktivierungsfehler
0110CDZK24: Low-side transistor test: deactivation errorZK24: Low-Side-Transistortest: Deaktivierungsfehler
0110CEZK16: Low-side transistor test: deactivation errorZK16: Low-Side-Transistortest: Deaktivierungsfehler
0110CFZK22: Low-side transistor test: deactivation errorZK22: Low-Side-Transistortest: Deaktivierungsfehler
0110D0ZK12: Low-side transistor test: deactivation errorZK12: Low-Side-Transistortest: Deaktivierungsfehler
0110D1ZK29: Low-side transistor test: deactivation errorZK29: Low-Side-Transistortest: Deaktivierungsfehler
0110D2ZK30: Low-side transistor test: deactivation errorZK30: Low-Side-Transistortest: Deaktivierungsfehler
0110D3ZK31: Low-side transistor test: deactivation errorZK31: Low-Side-Transistortest: Deaktivierungsfehler
0110D4ZK32: Low-side transistor test: deactivation errorZK32: Low-Side-Transistortest: Deaktivierungsfehler
0110D5ZK28: Low-side transistor test: deactivation errorZK28: Low-Side-Transistortest: Deaktivierungsfehler
0110D6ZK27: Low-side transistor test: deactivation errorZK27: Low-Side-Transistortest: Deaktivierungsfehler
0110D7ZK26: Low-side transistor test: deactivation errorZK26: Low-Side-Transistortest: Deaktivierungsfehler
0110D8ZK25: Low-side transistor test: deactivation errorZK25: Low-Side-Transistortest: Deaktivierungsfehler
0110D9Energy reserve: capacity errorEnergiereserve: Kapazitaetsfehler
0110DAEnergy reserve: discharge failureEnergiereserve: Entladungsfehler
0110DBEnergy reserve: Maximum charging time exceededEnergiereserve: Maximale Ladungszeit überschritten
0110DCEnergy reserve: ESR value too highEnergiereserve: ESR-Wert zu groß
0110E5Crash data buffer: OwerflowCrashdatenpuffer: Owerflow
0110E6RSU ASIC1: SPI interface: communication errorRSU ASIC1: SPI-Schnittstelle: Kommunikationsfehler
0110E7RSU ASIC2: SPI interface: communication errorRSU ASIC2: SPI-Schnittstelle: Kommunikationsfehler
0110E8RSU ASIC3: SPI interface: communication errorRSU ASIC3: SPI-Schnittstelle: Kommunikationsfehler
0110E9Energy reserve: short circuit to groundEnergiereserve: Kurzschluss nach Masse
0110EAError: no arming signal for immediate ignitionFehler: kein Arming-Signal für die sofortige Zündung
0110EBError: no arming signal for the delayed ignitionFehler: kein Arming-Signal für die zeitversetzte Zuendung
0110ECError: Constant crash stateFehler: Staendiger Crash-State
0110EDSC-NVRAM Manager: Config ID errorSC-NVRAM Manager: Config ID Fehler
0110EESC-NVRAM Manager: Error while writingSC-NVRAM Manager: Fehler beim Schreiben
0110EFSC-NVRAM Manager: Error readingSC-NVRAM Manager: Fehler beim Lesen
0110F0SC-NVRAM Manager: Error during control operationSC-NVRAM Manager: Fehler bei Control-Operation
0110F1SC-NVRAM Manager: Error when deletingSC-NVRAM Manager: Fehler beim Loeschen
0110F2SC-NVRAM Manager: Error during all write operationSC-NVRAM Manager: Fehler bei all Write Operation
0110F3Firing ASIC1: communication error with the safing ASIC (enable arming)Firing ASIC1: Kommunikationsfehler mit dem Safing-ASIC (enable arming)
0110F4Firing ASIC2: communication error with the safing ASIC (enable arming)Firing ASIC2: Kommunikationsfehler mit dem Safing-ASIC (enable arming)
0110F5Firing ASIC3: communication error with the safing ASIC (enable arming)Firing ASIC3: Kommunikationsfehler mit dem Safing-ASIC (enable arming)
0110F6Firing ASIC4: communication error with the safing ASIC (enable arming)Firing ASIC4: Kommunikationsfehler mit dem Safing-ASIC (enable arming)
0110F7Firing ASIC1: FENLS signal errorFiring ASIC1: FENLS-Signal Fehler
0110F8Firing ASIC2: FENLS signal errorFiring ASIC2: FENLS-Signal Fehler
0110F9Firing ASIC3: FENLS signal errorFiring ASIC3: FENLS-Signal Fehler
0110FAFiring ASIC4: FENLS signal errorFiring ASIC4: FENLS-Signal Fehler
0110FBFiring ASIC1: communication error with the safing ASIC (disable arming)Firing ASIC1: Kommunikationsfehler mit dem Safing-ASIC (disable arming)
0110FCFiring ASIC2: communication error with the safing ASIC (disable arming)Firing ASIC2: Kommunikationsfehler mit dem Safing-ASIC (disable arming)
0110FDFiring ASIC3: communication error with the safing ASIC (disable arming)Firing ASIC3: Kommunikationsfehler mit dem Safing-ASIC (disable arming)
0110FEFiring ASIC4: communication error with the safing ASIC (disable arming)Firing ASIC4: Kommunikationsfehler mit dem Safing-ASIC (disable arming)
0110FFZK1: Implausible measured values when measuring resistanceZK1: Unplausible Messwerte bei der Widerstandsmessung
011100ZK13: Implausible measured values when measuring resistanceZK13: Unplausible Messwerte bei der Widerstandsmessung
011101ZK3: Implausible measured values when measuring resistanceZK3: Unplausible Messwerte bei der Widerstandsmessung
011102ZK6: Implausible measured values when measuring resistanceZK6: Unplausible Messwerte bei der Widerstandsmessung
011103ZK17: Implausible measured values when measuring resistanceZK17: Unplausible Messwerte bei der Widerstandsmessung
011104ZK7: Implausible measured values when measuring resistanceZK7: Unplausible Messwerte bei der Widerstandsmessung
011105ZK4: Implausible measured values when measuring resistanceZK4: Unplausible Messwerte bei der Widerstandsmessung
011106ZK14: Implausible measured values when measuring resistanceZK14: Unplausible Messwerte bei der Widerstandsmessung
011107ZK19: Implausible measured values when measuring resistanceZK19: Unplausible Messwerte bei der Widerstandsmessung
011108ZK8: Implausible measured values when measuring resistanceZK8: Unplausible Messwerte bei der Widerstandsmessung
011109ZK2: Implausible measured values when measuring resistanceZK2: Unplausible Messwerte bei der Widerstandsmessung
01110AZK5: Implausible measured values when measuring resistanceZK5: Unplausible Messwerte bei der Widerstandsmessung
01110BZK23: Implausible measured values when measuring resistanceZK23: Unplausible Messwerte bei der Widerstandsmessung
01110CZK15: Implausible measured values when measuring resistanceZK15: Unplausible Messwerte bei der Widerstandsmessung
01110DZK21: Implausible measured values when measuring resistanceZK21: Unplausible Messwerte bei der Widerstandsmessung
01110EZK9: Implausible measured values when measuring resistanceZK9: Unplausible Messwerte bei der Widerstandsmessung
01110FZK18: Implausible measured values when measuring resistanceZK18: Unplausible Messwerte bei der Widerstandsmessung
011110ZK10: Implausible measured values when measuring resistanceZK10: Unplausible Messwerte bei der Widerstandsmessung
011111ZK20: Implausible measured values when measuring resistanceZK20: Unplausible Messwerte bei der Widerstandsmessung
011112ZK11: Implausible measured values when measuring resistanceZK11: Unplausible Messwerte bei der Widerstandsmessung
011113ZK24: Implausible measured values when measuring resistanceZK24: Unplausible Messwerte bei der Widerstandsmessung
011114ZK16: Implausible measured values when measuring resistanceZK16: Unplausible Messwerte bei der Widerstandsmessung
011115ZK22: Implausible measured values when measuring resistanceZK22: Unplausible Messwerte bei der Widerstandsmessung
011116ZK12: Implausible measured values when measuring resistanceZK12: Unplausible Messwerte bei der Widerstandsmessung
011117ZK29: Implausible measured values when measuring resistanceZK29: Unplausible Messwerte bei der Widerstandsmessung
011118ZK30: Implausible measured values when measuring resistanceZK30: Unplausible Messwerte bei der Widerstandsmessung
011119ZK31: Implausible measured values when measuring resistanceZK31: Unplausible Messwerte bei der Widerstandsmessung
01111AZK32: Implausible measured values when measuring resistanceZK32: Unplausible Messwerte bei der Widerstandsmessung
01111BZK28: Implausible measured values when measuring resistanceZK28: Unplausible Messwerte bei der Widerstandsmessung
01111CZK27: Implausible measured values when measuring resistanceZK27: Unplausible Messwerte bei der Widerstandsmessung
01111DZK26: Implausible measured values when measuring resistanceZK26: Unplausible Messwerte bei der Widerstandsmessung
01111EZK25: Implausible measured values when measuring resistanceZK25: Unplausible Messwerte bei der Widerstandsmessung
011122Safing microcontroller: sensor data errorSafing-Microcontroller: Sensordatenfehler
011124Safing microcontroller: internal errorSafing-Microcontroller: interner Fehler
011125wrong safing algofalscher Safing-Algo
011126AERIUS: configuration errorAERIUS: Konfigurationsfehler
011127Arming signal: active time too longArming-Signal: Aktivzeit zu groß
011128internal error Xgateinterner Fehler Xgate
01112AError in energy reserve, cyclical operationFehler Energiereserve zyklischer Betrieb
01112BSW execution error ignition routineSW Ausführungsfehler Zuendroutine
01112CBoost converter power supply faultyBoost Converter Spannungsversorgung fehlerhaft
01112DCAF 2/3 checksum errorCAF 2/3 Checksummenfehler
01112EExternal high-side switch errorFehler externer High-Side-Switch
01112FThe analog output to the ZK-ASIC1 is interruptedAnaloger Ausgang zum ZK-ASIC1 ist unterbrochen
011130The analog output to the ZK-ASIC2 is interruptedAnaloger Ausgang zum ZK-ASIC2 ist unterbrochen
011131The analog output to the ZK-ASIC3 is interruptedAnaloger Ausgang zum ZK-ASIC3 ist unterbrochen
011132The analog output to the ZK-ASIC4 is interruptedAnaloger Ausgang zum ZK-ASIC4 ist unterbrochen
011133Connection UP to the ZK-ASICs 1-4 has Short circuit to groundVerbindung uP zu den ZK-ASICs 1-4 hat Kurzschluss nach Masse
011134Connection uP to the ZK-ASICs 1-4 has Short circuit to positiveVerbindung uP zu den ZK-ASICs 1-4 hat Kurzschluss nach Plus
011135faulty software execution of processor core detectedfehlerhafte SW-Ausfuehrung von Prozessorkern erkannt
011136Incorrect memory access to data from processor core detectedfehlerhaften Speicherzugriff auf Daten von Prozessorkern erkannt
011137Incorrect memory access to UP commands from processor core detectedfehlerhaften Speicherzugriff auf uP-Befehle von Prozessorkern erkannt
011138Short circuit at the MUX for bused Hall sensorsKurzschluss am MUX für gebusste Hallsensoren
011139Line interruption between measuring point and bused Hall sensor output 1Leitungsunterbrechnung zwischen Messpunkt und gebusstem Hallsensor-Ausgang 1
01113ALine interruption between measuring point and bused Hall sensor output 2Leitungsunterbrechnung zwischen Messpunkt und gebusstem Hallsensor-Ausgang 2
01113BLine interruption between the measuring point and the bused Hall sensor output 3Leitungsunterbrechnung zwischen Messpunkt und gebusstem Hallsensor-Ausgang 3
01113CPower supply: Diode defective, ER charged / discharged too quicklySpannungsversorgung: Diode defekt, ER hat zu schnell geladen / entladen
01113DClock signal to Firing ASIC # 0 not correctTaktsignal zu Firing ASIC#0 nicht korrekt
01113EClock signal to Firing ASIC # 1 not correctTaktsignal zu Firing ASIC#1 nicht korrekt
01113FClock signal to Firing ASIC # 2 not correctTaktsignal zu Firing ASIC#2 nicht korrekt
011140Clock signal to Firing ASIC # 3 not correctTaktsignal zu Firing ASIC#3 nicht korrekt

012

CodeDescriptionGerman
012000COMBO2z_ISC - Sensor - Component faultCOMBO2z_ISC - Sensor - Component fault
012001COMBO2z_ISC - Sensor -Configuration Fault (wrong: ID, sensor, operationmode)COMBO2z_ISC - Sensor -Configuration Fault(wrong: ID, sensor, operationmode)
012002COMBO2z_ISC - Sensor -SPI fault (CRC & OPCODE Error)COMBO2z_ISC - Sensor -SPI fault (CRC & OPCODE Error)
012003FH_t_FC_CRC_FAIL_SQUIB_LIMITSFH_t_FC_CRC_FAIL_SQUIB_LIMITS
012004FH_t_FC_CRC_FAIL_SWITCH_CONFFH_t_FC_CRC_FAIL_SWITCH_CONF
012005FH_t_FC_CRC_FAIL_SWITCH_LIMITSFH_t_FC_CRC_FAIL_SWITCH_LIMITS
012006FH_t_FC_CRC_FAIL_IASG_LIMITSFH_t_FC_CRC_FAIL_IASG_LIMITS
012007COMBO2z_ISC - Sensor - Voltage faultCOMBO2z_ISC - Sensor - Voltage fault
012008FH_t_FC_SAFING_SPI_MONITOR_FAULTFH_t_FC_SAFING_SPI_MONITOR_FAULT
012009COMBO2y_PSC - Sensor - Configuration Fault (wrong: ID, sensor, operationmode)COMBO2y_PSC - Sensor - Configuration Fault (wrong: ID, sensor, operationmode)
01200ACOMBO2y_PSC - Sensor - SPI fault (CRC & OPCODE Error)COMBO2y_PSC - Sensor - SPI fault (CRC & OPCODE Error)
01200BCOMBO2y_PSC - Sensor - Component faultCOMBO2y_PSC - Sensor - Component fault
01200CFH_t_FC_CRC_FAIL_LD_LIMITSFH_t_FC_CRC_FAIL_LD_LIMITS
01200DFH_t_FC_CRC_FAIL_SQUIB_CONFIGFH_t_FC_CRC_FAIL_SQUIB_CONFIG
01200ECOMBO2z_RISC - Sensor component faultCOMBO2z_RISC - Sensor -Component fault
01200FCOMBO2z_RISC - Sensor -Configuration Fault (wrong: ID, sensor, operationmode)COMBO2z_RISC - Sensor -Configuration Fault (wrong: ID, sensor, operationmode)
012010COMBO2z_RISC - Sensor -SPI fault (CRC & OPCODE Error)COMBO2z_RISC - Sensor -SPI fault (CRC & OPCODE Error)
012011FC_MISMATCH_LAYOUT_EOL_MODAR_SWVFC_MISMATCH_LAYOUT_EOL_MODAR_SWV
012012FC_MISMATCH_LAYOUT_EOL_ISA_SWVFC_MISMATCH_LAYOUT_EOL_ISA_SWV
012013FC_INVALID_SW_CONF_OF_SENSORSFC_INVALID_SW_CONF_OF_SENSORS
012014FC_MODAR_DATAPREPFC_MODAR_DATAPREP
012015FC_ALGO_DATAPREPFC_ALGO_DATAPREP
012016FC_MODAR_DATAPREP_RAM_BUF_FULLFC_MODAR_DATAPREP_RAM_BUF_FULL
012017FC_MISMATCH_LAYOUT_EOL_PPS_SWVFC_MISMATCH_LAYOUT_EOL_PPS_SWV
012018FC_MISMATCH_LAYOUT_EOL_TILT_SWVFC_MISMATCH_LAYOUT_EOL_TILT_SWV
012019FC_ALGO_MODAR_EEPROM_CRC_FAILFC_ALGO_MODAR_EEPROM_CRC_FAIL
01201AFC_ALGO_ISA_EEPROM_CRC_FAILFC_ALGO_ISA_EEPROM_CRC_FAIL
01201BFC_ALGO_PPS_EEPROM_CRC_FAILFC_ALGO_PPS_EEPROM_CRC_FAIL
01201CFC_ALGO_TILT_EEPROM_CRC_FAILFC_ALGO_TILT_EEPROM_CRC_FAIL
01201EFC_TILT_CODING_IMPLAUSIBLEFC_TILT_CODING_IMPLAUSIBLE
01201FInfo FEE Code Flash: no empty sector for data storage availableInfo FEE Code Flash: no empty sector for data storage available
012021FC_COMBO_HW_Variant_1FC_COMBO_HW_Variant_1
012022FC_COMBO_HW_Variant_2FC_COMBO_HW_Variant_2
012023FC_COMBO_1_2_PERMANENT_DEFECT_1FC_COMBO_1_2_PERMANENT_DEFECT_1
012024FC_COMBO_1_2_PERMANENT_DEFECT_2FC_COMBO_1_2_PERMANENT_DEFECT_2
012025FC_COMBO_2_PERMANENT_DEFECT_1FC_COMBO_2_PERMANENT_DEFECT_1
012026FC_COMBO_3_PERMANENT_DEFECT_1FC_COMBO_3_PERMANENT_DEFECT_1
012027FC_COMBO_4_PERMANENT_DEFECT_1FC_COMBO_4_PERMANENT_DEFECT_1
012028FC_COMBO_1_PERMANENT_DEFECT_1FC_COMBO_1_PERMANENT_DEFECT_1
012029FC_COMBO_1_PERMANENT_DEFECT_2FC_COMBO_1_PERMANENT_DEFECT_2
012030FC_ISC_DEADTIME_MONITORING_TIMEOUTFC_ISC_DEADTIME_MONITORING_TIMEOUT

013

CodeDescriptionGerman
013000FltAB1FDHighSidePowerstageFltAB1FDHighSidePowerstage
013001FltAB1FDLowSidePowerstageFltAB1FDLowSidePowerstage
013002FltAB2FDHighSidePowerstageFltAB2FDHighSidePowerstage
013003FltAB2FDLowSidePowerstageFltAB2FDLowSidePowerstage
013004FltAAV1FDHighSidePowerstageFltAAV1FDHighSidePowerstage
013005FltAAV1FDLowSidePowerstageFltAAV1FDLowSidePowerstage
013006FltAB1FPHighSidePowerstageFltAB1FPHighSidePowerstage
013007FltAB1FPLowSidePowerstageFltAB1FPLowSidePowerstage
013008FltAB2FPHighSidePowerstageFltAB2FPHighSidePowerstage
013009FltAB2FPLowSidePowerstageFltAB2FPLowSidePowerstage
01300AFltAAV1FPHighSidePowerstageFltAAV1FPHighSidePowerstage
01300BFltAAV1FPLowSidePowerstageFltAAV1FPLowSidePowerstage
01300CFltBT1FDHighSidePowerstageFltBT1FDHighSidePowerstage
01300DFltBT1FDLowSidePowerstageFltBT1FDLowSidePowerstage
01300EFltCT1FDHighSidePowerstageFltCT1FDHighSidePowerstage
01300FFltCT1FDLowSidePowerstageFltCT1FDLowSidePowerstage
013010FltBL1FDHighSidePowerstageFltBL1FDHighSidePowerstage
013011FltBL1FDLowSidePowerstageFltBL1FDLowSidePowerstage
013012FltBT1FPHighSidePowerstageFltBT1FPHighSidePowerstage
013013FltBT1FPLowSidePowerstageFltBT1FPLowSidePowerstage
013014FltCT1FPHighSidePowerstageFltCT1FPHighSidePowerstage
013015FltCT1FPLowSidePowerstageFltCT1FPLowSidePowerstage
013016FltBL1FPHighSidePowerstageFltBL1FPHighSidePowerstage
013017FltBL1FPLowSidePowerstageFltBL1FPLowSidePowerstage
013018FltKB1FDHighSidePowerstageFltKB1FDHighSidePowerstage
013019FltKB1FDLowSidePowerstageFltKB1FDLowSidePowerstage
01301AFltKB1FPHighSidePowerstageFltKB1FPHighSidePowerstage
01301BFltKB1FPLowSidePowerstageFltKB1FPLowSidePowerstage
013028FltSA1FDHighSidePowerstageFltSA1FDHighSidePowerstage
013029FltSA1FDLowSidePowerstageFltSA1FDLowSidePowerstage
01302AFltSA1FPHighSidePowerstageFltSA1FPHighSidePowerstage
01302BFltSA1FPLowSidePowerstageFltSA1FPLowSidePowerstage
01302CFltCA1LHighSidePowerstageFltCA1LHighSidePowerstage
01302DFltCA1LLowSidePowerstageFltCA1LLowSidePowerstage
01302EFltCA1RHighSidePowerstageFltCA1RHighSidePowerstage
01302FFltCA1RLowSidePowerstageFltCA1RLowSidePowerstage
013030FltBATD1HighSidePowerstageFltBATD1HighSidePowerstage
013031FltBATD1LowSidePowerstageFltBATD1LowSidePowerstage
013032FltBATD2HighSidePowerstageFltBATD2HighSidePowerstage
013033FltBATD2LowSidePowerstageFltBATD2LowSidePowerstage
013038FltPPAFLHighSidePowerstageFltPPAFLHighSidePowerstage
013039FltPPAFLLowSidePowerstageFltPPAFLLowSidePowerstage
01303AFltPPAFRHighSidePowerstageFltPPAFRHighSidePowerstage
01303BFltPPAFRLowSidePowerstageFltPPAFRLowSidePowerstage
01303CFltPPARLHighSidePowerstageFltPPARLHighSidePowerstage
01303DFltPPARLLowSidePowerstageFltPPARLLowSidePowerstage
01303EFltPPARRHighSidePowerstageFltPPARRHighSidePowerstage
01303FFltPPARRLowSidePowerstageFltPPARRLowSidePowerstage
013040FltRUTFDHighSidePowerstageFltRUTFDHighSidePowerstage
013041FltRUTFDLowSidePowerstageFltRUTFDLowSidePowerstage
013042FltRUTFPHighSidePowerstageFltRUTFPHighSidePowerstage
013043FltRUTFPLowSidePowerstageFltRUTFPLowSidePowerstage
013044FltCAHRDHighSidePowerstageFltCAHRDHighSidePowerstage
013045FltCAHRDLowSidePowerstageFltCAHRDLowSidePowerstage
013046FltBT1RLHighSidePowerstageFltBT1RLHighSidePowerstage
013047FltBT1RLLowSidePowerstageFltBT1RLLowSidePowerstage
013048FltBT1RRHighSidePowerstageFltBT1RRHighSidePowerstage
013049FltBT1RRLowSidePowerstageFltBT1RRLowSidePowerstage
01304EFltHVD3HighSidePowerstageFltHVD3HighSidePowerstage
01304FFltHVD3LowSidePowerstageFltHVD3LowSidePowerstage
013050FltROLLBARLHighSidePowerstageFltROLLBARLHighSidePowerstage
013051FltROLLBARLLowSidePowerstageFltROLLBARLLowSidePowerstage
013052FltROLLBARRHighSidePowerstageFltROLLBARRHighSidePowerstage
013053FltROLLBARRHighSidePowerstageFltROLLBARRHighSidePowerstage
013054FltROLLMAGLHighSidePowerstageFltROLLMAGLHighSidePowerstage
013055FltROLLMAGLLowSidePowerstageFltROLLMAGLLowSidePowerstage
013056FltROLLMAGRHighSidePowerstageFltROLLMAGRHighSidePowerstage
013057FltROLLMAGRLowSidePowerstageFltROLLMAGRLowSidePowerstage
013058FltCAHRPHighSidePowerstageFltCAHRPHighSidePowerstage
013059FltCAHRPLowSidePowerstageFltCAHRPLowSidePowerstage
013080FltUFSLInternalCommunicationFltUFSLInternalCommunication
013081FltUFSRInternalCommunicationFltUFSRInternalCommunication
013082FltPBLXInternalCommunicationFltPBLXInternalCommunication
013083FltPBLYInternalCommunicationFltPBLYInternalCommunication
013084FltPBRXInternalCommunicationFltPBRXInternalCommunication
013085FltPBRYInternalCommunicationFltPBRYInternalCommunication
013086FltPPSLInternalCommunicationFltPPSLInternalCommunication
013087FltPPSRInternalCommunicationFltPPSRInternalCommunication
013089FltCRCErrorExternalFltCRCErrorExternal
01308AFltSwitchInvalidConfigFltSwitchInvalidConfig
01308BFltSEMConfigurationFltSEMConfiguration
01308CFltAsicPsiInterfaceFltAsicPsiInterface
013100FltDCUXInternalCommunicationFltDCUXInternalCommunication
013101FltDCUYInternalCommunicationFltDCUYInternalCommunication
013102FltSMI510ZInternalCommunicationFltSMI510ZInternalCommunication
013103FltSMI510YInternalCommunicationFltSMI510YInternalCommunication
013104FltSMI510RRInternalCommunicationFltSMI510RRInternalCommunication
013105FltMCSICH1InternalCommunicationFltMCSICH1InternalCommunication
013106FltMCSICH2InternalCommunicationFltMCSICH2InternalCommunication
013107FltMCSICH3InternalCommunicationFltMCSICH3InternalCommunication
01310BFltSBSHFInternalCommunicationFltSBSHFInternalCommunication

014

CodeDescriptionGerman
014000IdleModeIdleMode
014001FltE2promNoCommunicationFltE2promNoCommunication
014002FltE2promWriteTimeoutFltE2promWriteTimeout
014003FltE2promWriteVerifyFaultFltE2promWriteVerifyFault
014004FltERMissingFltERMissing
014005FltERCapacityFltERCapacity
014006FltERAutarkyCurrentFltERAutarkyCurrent
014007FltERUpConverterFltERUpConverter
014008FltERESRFltERESR
014009FltERPPTestFltERPPTest
01400AFltFLICAoutENFLShortFltFLICAoutENFLShort
01400BFltSystemAsic1ENFLPowerstageFltSystemAsic1ENFLPowerstage
01400CFltSystemAsic1SplDisablePowerstageFltSystemAsic1SplDisablePowerstage
01400DFltSystemAsic1SquibRefResistanceFltSystemAsic1SquibRefResistance
01400EFltSystemAsic1SquibERVoltageFltSystemAsic1SquibERVoltage
01400FFltSystemAsic1VASVoltageFltSystemAsic1VASVoltage
014011FltAB9FlicRRefResistanceFltAB9FlicRRefResistance
014012FltAB9FLICSplDisablePowerstageFltAB9FLICSplDisablePowerstage
014013FltAB9FlicERVoltageFltAB9FlicERVoltage
014014FltAB9FlicRMVoltageFltAB9FlicRMVoltage
014015FltAB9FLICAoutDisAHPShortFltAB9FLICAoutDisAHPShort
014016FltRAMSquibFiringStatusFltRAMSquibFiringStatus
014017FltSquibConfigPlausibilityFltSquibConfigPlausibility
014018FltSystemAsicOverTemperatureFltSystemAsicOverTemperature
014019FltCompanionAsicOverTemperatureFltCompanionAsicOverTemperature
01401AFltDisableLinesFltDisableLines
01401BFltSCONPlausibilityPathFltSCONPlausibilityPath
01401CFltCOMPDisLinesconnectionFltCOMPDisLinesconnection
01401DFltWD1FltWD1
01401EFltWD2FltWD2
01401FFltWD3FltWD3
014020FltWDSeqFltWDSeq
014021FltWDTempFltWDTemp
014022FltWDDisFltWDDis
014023FltSVRFailureFltSVRFailure
014024FltSystemAsic1AMUBusyFltSystemAsic1AMUBusy
014025FltSystemAsic1AMUTiming1FltSystemAsic1AMUTiming1
014026FltSystemAsic1AMUTiming2FltSystemAsic1AMUTiming2
014027FltSystemAsic1AMUTiming3FltSystemAsic1AMUTiming3
014028FltSystemAsic1AMUTiming4FltSystemAsic1AMUTiming4
014029FltSystemAsic1AMUAdcFltSystemAsic1AMUAdc
01402AFltSystemAsic1AMUMuxTest1FltSystemAsic1AMUMuxTest1
01402BFltSystemAsic1AMUMuxTest2FltSystemAsic1AMUMuxTest2
01402CFltSystemAsic1AMUMuxTest3FltSystemAsic1AMUMuxTest3
01402EFltPreMuxTestFltPreMuxTest
01402FFltADCFltADC
014030FltBISTFailureFltBISTFailure
014031FltNSYSRESShortToVST33FltNSYSRESShortToVST33
014033FltIllegalEventFltIllegalEvent
014035FltSpiTFFFltSpiTFF
014036FltCCTFailedFltCCTFailed
014037FltIniTestTimeOutFltIniTestTimeOut
014039FltCRCClassFaultFltCRCClassFault
01403AFltCRCDataSetInvalidFltCRCDataSetInvalid
01403BFltCRCDataSetNotEqualFltCRCDataSetNotEqual
01403CFltCRCRamFaultFltCRCRamFault
01403DFltCRCPrimaryFltCRCPrimary
01403EFltSystemAsic1RegProgFltSystemAsic1RegProg
01403FFltSystemAsic1EopFltSystemAsic1Eop
014040FltSystemAsic1RegMonFltSystemAsic1RegMon
014041FltSystemAsic1EopMonFltSystemAsic1EopMon
014042FltParameterLayoutIDInvalidFltParameterLayoutIDInvalid
014043FltCoreVtgFailureFltCoreVtgFailure
014044FltStackOverFlowFltStackOverFlow
014045FltROMTestFailedFltROMTestFailed
014046FltRAMFailureFltRAMFailure
014047FltSystemAsic1IPPProgrammingFltSystemAsic1IPPProgramming
014052FltCF190PasLine1RegProgFltCF190PasLine1RegProg
014053FltCF190PasLine2RegProgFltCF190PasLine2RegProg
014055FltKline1NoCommFltKline1NoComm
014057FltERVDNFltERVDN
014058FltVerHighFltVerHigh
014059FltVerLowFltVerLow
01405AFltSdlHwSwMismatchFltSdlHwSwMismatch
01405BFltSystemAsic1CfgMismatchFltSystemAsic1CfgMismatch
01405DFltCG9859CfgMismatchFltCG9859CfgMismatch
01405EFltCsAsicXYCfgMismatchFltCsAsicXYCfgMismatch
014070SAPHIR-Line 1: KS_to_GndSAPHIR-Line 1: KS_to_Gnd
014071SAPHIR-Line 1: KS_to_UbatSAPHIR-Line 1: KS_to_Ubat
014072SAPHIR-Line 1: CrossCoupleSAPHIR-Line 1: CrossCouple
014073SAPHIR-Line 2: KS_to_GndSAPHIR-Line 2: KS_to_Gnd
014074SAPHIR-Line 2: KS_to_UbatSAPHIR-Line 2: KS_to_Ubat
014075SAPHIR-Line 2: CrossCoupleSAPHIR-Line 2: CrossCouple
014076SAPHIR-Line 3: KS_to_GndSAPHIR-Line 3: KS_to_Gnd
014077SAPHIR-Line 3: KS_to_UbatSAPHIR-Line 3: KS_to_Ubat
014078SAPHIR-Line 3: CrossCoupleSAPHIR-Line 3: CrossCouple
014079SAPHIR-Line 4: KS_to_GndSAPHIR-Line 4: KS_to_Gnd
01407ASAPHIR-Line 4: KS_to_UbatSAPHIR-Line 4: KS_to_Ubat
01407BSAPHIR-Line 4: CrossCoupleSAPHIR-Line 4: CrossCouple
01407CRAMSES line 1: KS_to_GndRAMSES-Line 1: KS_to_Gnd
01407DRAMSES Line 1: KS_to_UbatRAMSES-Line 1: KS_to_Ubat
01407ERAMSES-Line 1: CrossCoupleRAMSES-Line 1: CrossCouple
01407FRAMSES-Line 2: KS_to_GndRAMSES-Line 2: KS_to_Gnd
014080RAMSES-Line 2: KS_to_UbatRAMSES-Line 2: KS_to_Ubat
014081RAMSES-Line 2: CrossCoupleRAMSES-Line 2: CrossCouple
014082CF190: EClkMonTestCF190: EClkMonTest
014083CF190: EClkInterruptionCF190: EClkInterruption

015

CodeDescriptionGerman
015000Airbag sensor B-pillar right (x-direction) - plausibility errorAirbagsensor B-Saeule rechts (x-Richtung) - Plausibilitaetsfehler
015001Airbag sensor B-pillar right (x-direction) - communication faultAirbagsensor B-Saeule rechts (x-Richtung) - Kommunikationsstoerung
015002Airbag sensor B-pillar right (y-direction) - plausibility errorAirbagsensor B-Saeule rechts (y-Richtung) - Plausibilitaetsfehler
015003Airbag sensor, B-pillar, right (y-direction) - communication faultAirbagsensor B-Saeule rechts (y-Richtung) - Kommunikationsstoerung
015004Airbag sensor B-pillar left (x-direction) - plausibility errorAirbagsensor B-Saeule links (x-Richtung) - Plausibilitaetsfehler
015005Airbag sensor, B-pillar left (x-direction) - communication faultAirbagsensor B-Saeule links (x-Richtung) - Kommunikationsstoerung
015006Airbag sensor B-pillar left (y-direction) - plausibility errorAirbagsensor B-Saeule links (y-Richtung) - Plausibilitaetsfehler
015007Left B-pillar airbag sensor (y-direction) - communication faultAirbagsensor B-Saeule links (y-Richtung) - Kommunikationsstoerung
015008Airbag sensor cluster (high g x direction) - plausibility errorAirbagsensor-Cluster (high g x-Richtung) - Plausibilitaetsfehler
015009Airbag sensor cluster (high g x direction) - communication disruptionAirbagsensor-Cluster (high g x-Richtung) - Kommunikationsstoerung
01500AAirbag sensor cluster (high g y direction) - plausibility errorAirbagsensor-Cluster (high g y-Richtung) - Plausibilitaetsfehler
01500BAirbag sensor cluster (high g y direction) - communication faultAirbagsensor-Cluster (high g y-Richtung) - Kommunikationsstoerung
01500DAirbag sensor cluster (SBS sensor) - communication faultAirbagsensor-Cluster (SBS-Sensor) - Kommunikationsstoerung
01500EAirbag sensor cluster (low g y direction) - plausibility errorAirbagsensor-Cluster (low g y-Richtung) - Plausibilitaetsfehler
01500FAirbag sensor cluster (low g y direction) - communication faultAirbagsensor-Cluster (low g y-Richtung) - Kommunikationsstoerung
015010Airbag sensor cluster (low g z-direction) - plausibility errorAirbagsensor-Cluster (low g z-Richtung) - Plausibilitaetsfehler
015011Airbag sensor cluster (low g z direction) - communication faultAirbagsensor-Cluster (low g z-Richtung) - Kommunikationsstoerung
015012Airbag sensor cluster (rate of rotation) - plausibility errorAirbagsensor-Cluster (Drehrate) - Plausibilitaetsfehler
015013Airbag sensor cluster (rate of rotation) - communication disruptionAirbagsensor-Cluster (Drehrate) - Kommunikationsstoerung
015014FGS_SB Pedestrian protection sensor channel 1 - plausibility errorFGS_SB Fussgängerschutzsensor Kanal 1 - Plausibilitaetsfehler
015015FGS_SB pedestrian protection sensor channel 1- sends errorFGS_SB Fussgängerschutzsensor Kanal 1- sendet Fehler
015016FGS_SB Pedestrian protection sensor channel 1 - wrong sensor typeFGS_SB Fussgängerschutzsensor Kanal 1 - Sensortyp falsch
015017FGS_SB Pedestrian protection sensor channel 1 - communication faultFGS_SB Fussgängerschutzsensor Kanal 1 - Kommunikationsstoerung
015018FGS_SB Pedestrian protection sensor channel 1 - signal plausibility errorFGS_SB Fussgängerschutzsensor Kanal 1 - Signalplausibilitaetsfehler
015019FGS_SB Pedestrian protection sensor channel 2- plausibility errorFGS_SB Fussgängerschutzsensor Kanal 2- Plausibilitaetsfehler
01501AFGS_SB pedestrian protection sensor channel 2- sends errorFGS_SB Fussgängerschutzsensor Kanal 2- sendet Fehler
01501BFGS_SB Pedestrian protection sensor channel 2 - wrong sensor typeFGS_SB Fussgängerschutzsensor Kanal 2 - Sensortyp falsch
01501CFGS_SB Pedestrian protection sensor channel 2 - communication faultFGS_SB Fussgängerschutzsensor Kanal 2 - Kommunikationsstoerung
01501DFGS_SB Pedestrian protection sensor channel 2 - signal plausibility errorFGS_SB Fussgängerschutzsensor Kanal 2 - Signalplausibilitaetsfehler
01501EFGS_SB Pedestrian protection sensor channel 3- plausibility errorFGS_SB Fussgängerschutzsensor Kanal 3- Plausibilitaetsfehler
01501FFGS_SB pedestrian protection sensor channel 3- sends errorFGS_SB Fussgängerschutzsensor Kanal 3- sendet Fehler
015020FGS_SB Pedestrian protection sensor channel 3 - wrong sensor typeFGS_SB Fussgängerschutzsensor Kanal 3 - Sensortyp falsch
015021FGS_SB Pedestrian protection sensor channel 3 - communication faultFGS_SB Fussgängerschutzsensor Kanal 3 - Kommunikationsstoerung
015022FGS_SB Pedestrian protection sensor channel 3 - signal plausibility errorFGS_SB Fussgängerschutzsensor Kanal 3 - Signalplausibilitaetsfehler
015023FltSWVersionFltSWVersion
015024EEPROM layout mismatchEEPROM Layout Mismatch

016

CodeDescriptionGerman
016000Reference detonator ATIC 129 1Referenzzündpille ATIC 129 1
016001Reference detonator ATIC 129 2Referenzzündpille ATIC 129 2
016002Reference detonator ATIC 129 3Referenzzündpille ATIC 129 3
016003Reference detonator ATIC 99Referenzzündpille ATIC 99
016004SYC VZ Voltage too highSYC VZ Voltage too high
016005EXC1 VZ Voltage too highEXC1 VZ Voltage too high
016006EXC2 VZ Voltage too highEXC2 VZ Voltage too high
016007EXC3 VZ Voltage too highEXC3 VZ Voltage too high
016010Internal voltage ATIC 129 1Interne Spannung ATIC 129 1
016011Internal voltage ATIC 129 2Interne Spannung ATIC 129 2
016012Internal voltage ATIC 129 3Interne Spannung ATIC 129 3
016013Internal voltage ATIC 99Interne Sapannung ATIC 99
016020Ignition voltage ATIC 129 1Zündspannung ATIC 129 1
016021Ignition voltage ATIC 129 2Zündspannung ATIC 129 2
016022Ignition voltage ATIC 129 3Zündspannung ATIC 129 3
016023Ignition voltage ATIC 99Zündspannung ATIC 99
016030ROM CRC failedROM CRC fehlgeschlagen
016031RAM start-up test failedRAM Start-up Test fehlgeschlagen
016032RAM CRC failedRAM CRC fehlgeschlagen
016035Safing transistor test failedSafing Transistor Test fehlgeschlagen
016040Parameter CRC error algorithm, pageParameter-CRC-Fehler Algorithmus, Seite
016041Parameter CRC error algorithm, frontParameter-CRC-Fehler Algorithmus, Front
016042Parameter CRC error algorithm, heckParameter-CRC-Fehler Algorithmus, Heck
016043Parameter CRC error algorithm, rolloverParameter-CRC-Fehler Algorithmus, Rollover
016045Parameter CRC error squib limitsParameter-CRC-Fehler Zündpillengrenzen
016046Parameter CRC error Hall sensor limitsParameter-CRC-Fehler Hall-Sensoren-Limits
016047Parameter CRC error IASGParameter-CRC-Fehler IASG
01604AParameter CRC error satellite, sensing directionParameter-CRC-Fehler Satelliten, Sensierungsrichtung
016050Low side switch ignition output stage defective ATIC 99Low Side Schalter Zündendstufe defekt ATIC 99
016051Low side switch ignition output stage defective ATIC 129 1Low Side Schalter Zündendstufe defekt ATIC 129 1
016052Low side switch ignition output stage defective ATIC 129 2Low Side Schalter Zündendstufe defekt ATIC 129 2
016053Low side switch ignition output stage defective ATIC 129 3Low Side Schalter Zündendstufe defekt ATIC 129 3
016054Low side switch ignition output stage defective Rollover 1Low Side Schalter Zündendstufe defekt Rollover 1
016055Low side switch ignition output stage defective rollover 2Low Side Schalter Zündendstufe defekt Rollover 2
016060High side switch ignition output stage defective ATIC 99High Side Schalter Zündendstufe defekt ATIC 99
016061High side switch ignition output stage defective ATIC 129 1High Side Schalter Zündendstufe defekt ATIC 129 1
016062High side switch ignition output stage defective ATIC 129 2High Side Schalter Zündendstufe defekt ATIC 129 2
016063High side switch ignition output stage defective ATIC 129 3High Side Schalter Zündendstufe defekt ATIC 129 3
016064High side switch ignition output stage defective Rollover 1High Side Schalter Zündendstufe defekt Rollover 1
016065High side switch ignition output stage defective rollover 2High Side Schalter Zündendstufe defekt Rollover 2
016070Ignition current, ignition time configuration failed ATIC 99Zündstrom, Zündzeit Konfiguration fehlgeschlagen ATIC 99
016071Ignition current, ignition time configuration failed ATIC 129 1Zündstrom, Zündzeit Konfiguration fehlgeschlagen ATIC 129 1
016072Ignition current, ignition time configuration failed ATIC 129 2Zündstrom, Zündzeit Konfiguration fehlgeschlagen ATIC 129 2
016073Ignition current, ignition time configuration failed ATIC 129 3Zündstrom, Zündzeit Konfiguration fehlgeschlagen ATIC 129 3
016090Ignition release lines: ARMQ satellite errorZündfreigabeleitungen: ARMQ Satellit Fehler
016091Ignition release lines: ARMQ OMNI errorZündfreigabeleitungen: ARMQ OMNI Fehler
016092Ignition release lines: ARMQ HSX errorZündfreigabeleitungen: ARMQ HSX Fehler
016093Ignition release lines: TestMQ errorZündfreigabeleitungen: TestMQ Fehler
016094Ignition release lines: Error in the release lineZündfreigabeleitungen: Fehler in Freigabeleitung
016095Ignition release lines: ARMI SCRAP errorZündfreigabeleitungen: ARMI SCRAP Fehler
016096LSEN2Q errorLSEN2Q Fehler
016097HS RES LEAK TO GROUND errorHS RES LEAK TO GROUND Fehler
016098LD 1 OPEN errorLD 1 OPEN Fehler
016099LD 2 OPEN errorLD 2 OPEN Fehler
01609AHS RES LEAK TO UBATT errorHS RES LEAK TO UBATT Fehler
01609BVZ FA errorVZ FA Fehler
01609CVSGC FaultVSGC Fault
01609DRollover CAPA MeasurementRollover CAPA Measurement
0160A0Energy reserve capacitor: capacity too small or not availableEnergiereserve-Kondensator: Kapazität zu klein oder nicht vorhanden
0160B0Self-sufficiency time too shortAutarkiezeit zu klein
0160C0Microcontroller ports coupled / open uC pinsMicrocontroller Ports verkoppelte/offene uC-Pins
0160E2CANNM_E_NETWORK_TIMEOUTCANNM_E_NETWORK_TIMEOUT
0160F0CANTP_E_COMCANTP_E_COM
0160F1CANTP_E_OPER_NOT_SUPPORTEDCANTP_E_OPER_NOT_SUPPORTED
016110EEP_E_WORN_OUTEEP_E_WORN_OUT
016111EEP_E_READY_SECTORSEEP_E_READY_SECTORS
016140Fault memory blocked due to crash entryFehlerspeicher gesperrt wegen Crasheintrag
016141Fault memory blocked due to crash entryFehlerspeicher gesperrt wegen Crasheintrag
016170ECUM_E_RAM_CHECK_FAILEDECUM_E_RAM_CHECK_FAILED
016171ECUM_E_RAM_CHECKED_FAILEDECUM_E_RAM_CHECKED_FAILED
016181VSM_EVENT_OPMODE_OLDVSM_EVENT_OPMODE_OLD
016200DARH_EVENT_ID_DELETE_ERROR_DARH_EVENT_ID_DELETE_ERROR_
016201Information code phase 2AInformation Code Phase 2A
016202Information code phase 2BInformation Code Phase 2B
016203Information code phase 3AInformation Code Phase 3A
016204Information code phase 3BInformation Code Phase 3B
016205Information code phase 3CInformation Code Phase 3C
016206> Information code phase 3D>Information Code Phase 3D
016207Information code phase 3EInformation Code Phase 3E
016208Information code phase COMPLETEDInformation Code Phase COMPLETED
016209VRCM error ATIC 99VRCM Fehler ATIC 99
01620AInternal Fault ATIC 99Internal Fault ATIC 99
01620BHal Undervoltage FaultHal Undervoltage Fault
01620CHal Overvoltage FaultHal Overvoltage Fault
01620DHal Internal Undervoltage Fault ACE4Hal Internal Undervoltage Fault ACE4
01620EHal Internal Overvoltage Fault ACE4Hal Internal Overvoltage Fault ACE4
01620FHal Internal Undervoltage Fault AFS1Hal Internal Undervoltage Fault AFS1
016210Hal Internal Overvoltage Fault AFS1Hal Internal Overvoltage Fault AFS1
016211Hal Internal Undervoltage Fault AFS2Hal Internal Undervoltage Fault AFS2
016212Hal Internal Overvoltage Fault AFS2Hal Internal Overvoltage Fault AFS2
016214Hal Internal Undervoltage Fault AFS3Hal Internal Undervoltage Fault AFS3
016215Hal Internal Overvoltage Fault AFS3Hal Internal Overvoltage Fault AFS3
016218Spi AsicSpi Asic
016219SQRef AFS1SQRef AFS1
01621ASQRef AFS2SQRef AFS2
01621DFLENFLEN
01621ECapacity missingCapacity Missing
01621FCapa MeasCapa Meas
016220resetReset
016221ExceptionException
016222Watchdog FailWatchdog Fail
016223Autarchy TimeAutarchy Time
016224ROM CRC FailROM CRC Fail
016225RAM CRC FailRAM CRC Fail
016226Stack cyclic failStack Cyclic Fail
016227EEPROM CRC FailEEPROM CRC Fail
016228VrefVref
01622BIC Side Algo StartedIC Side Algo Started
01622CIC Side Algo ResetIC Side Algo Reset
01622DIC Conn KL15IC Conn KL15
01622EIC Capa Meas NOKIC Capa Meas NOK
01622FIC Capa Meas SkippedIC Capa Meas Skipped
016230IC_ATIC95 1 SPIERRIC_ATIC95 1 SPIERR
016231IC_ATIC95 2 SPIERRIC_ATIC95 2 SPIERR
016232IASG multiplex driver defectiveIASG Multiplex-Treiber defekt
016233ATIC 99 discrete hardware coupling network defectiveATIC 99 diskrete Hardware Verkopplungsnetzwerk defekt
016300Error memory blocked due to diagnostic commandFehlerspeicher gesperrt wegen Diagnosebefehl
016301Fault memory blocked due to crash entryFehlerspeicher gesperrt wegen Crasheintrag

019

CodeDescriptionGerman
019000COMM_E_STOP_Tx_TIMEOUT_C0COMM_E_STOP_Tx_TIMEOUT_C0
019001COMM_E_START_Tx_TIMEOUT_C0COMM_E_START_Tx_TIMEOUT_C0
019002CAN_E_TIMEOUTCAN_E_TIMEOUT
019003Error could not be sent after the maximum number of attemptsFehler konnte nach maximaler Anzahl von Versuchen nicht gesendet werden
019004Outgoing error message buffer is fullPuffer für ausgehende Fehlermeldungen ist voll
019006Message (vehicle status, 0x3A0) is missingBotschaft (Fahrzeugzustand, 0x3A0) fehlt
019007CANIF_E_INVALID_TXPDUIDCANIF_E_INVALID_TXPDUID
019008CANIF_E_INVALID_RXPDUIDCANIF_E_INVALID_RXPDUID
019009NVM_E_REQ_FAILEDNVM_E_REQ_FAILED
01900AECUM_E_ALL_RUN_REQUESTS_KILLEDECUM_E_ALL_RUN_REQUESTS_KILLED
01900BCOMM_E_NET_START_IND_CHANNEL_0COMM_E_NET_START_IND_CHANNEL_0
019010VSM_EVENT_OPMODEVSM_EVENT_OPMODE
019011WDGM_E_ALIVE_SUPERVISIONWDGM_E_ALIVE_SUPERVISION
019012PIA_E_IO_ERRORPIA_E_IO_ERROR
019013FR_E_ACCESSFR_E_ACCESS
019014FRIF_E_JLE_SYNCFRIF_E_JLE_SYNC
019015FRTRCV_10_TJA1080_E_FR_NO_TRCV_CFRTRCV_10_TJA1080_E_FR_NO_TRCV_C
019017CNM_E_NETWORK_TIMEOUTCNM_E_NETWORK_TIMEOUT
019018FLS_E_ERASE_FAILEDFLS_E_ERASE_FAILED
019019FLS_E_WRITE_FAILEDFLS_E_WRITE_FAILED
01901AFLS_E_READ_FAILEDFLS_E_READ_FAILED
01901BFLS_E_COMPARE_FAILEDFLS_E_COMPARE_FAILED
01901CIPDUM_E_TRANSMIT_FAILEDIPDUM_E_TRANSMIT_FAILED
01901DCOMM_E_START_Tx_TIMEOUT_C1COMM_E_START_Tx_TIMEOUT_C1
01901ECOMM_E_STOP_Tx_TIMEOUT_C1COMM_E_STOP_Tx_TIMEOUT_C1
01901FCOMM_E_NET_START_IND_CHANNEL_1COMM_E_NET_START_IND_CHANNEL_1
019020LINIF_E_RESPONSELINIF_E_RESPONSE
019021LINIF_E_NC_NO_RESPONSELINIF_E_NC_NO_RESPONSE
019022CSM_E_ERROR_EVENTCSM_E_ERROR_EVENT
019023NVM_E_INTEGRITY_FAILEDNVM_E_INTEGRITY_FAILED
019024CANIF_E_FULL_TX_BUFFERCANIF_E_FULL_TX_BUFFER
019025CANIF_E_STOPPEDCANIF_E_STOPPED
019026CANNM_E_INIT_FAILEDCANNM_E_INIT_FAILED
019027CANNM_E_CANIF_TRANSMIT_ERRORCANNM_E_CANIF_TRANSMIT_ERROR
019028CANTP_E_COMMCANTP_E_COMM
019029CNM_E_TX_PATH_FAILEDCNM_E_TX_PATH_FAILED
01902BFEE_E_WRITE_FAILEDFEE_E_WRITE_FAILED
01902CWDGM_E_SET_MODEWDGM_E_SET_MODE
01902DWDG_E_MODE_SWITCH_FAILEDWDG_E_MODE_SWITCH_FAILED
01902EWDG_E_DISABLE_REJECTEDWDG_E_DISABLE_REJECTED
01902FMCU_E_LOCK_FAILUREMCU_E_LOCK_FAILURE
019031Signal (Zeit_Sekunde_Zaehler_Relativ, 0x328): invalidSignal (Zeit_Sekunde_Zaehler_Relativ, 0x328): ungültig
019032MCU_E_CLOCK_FAILUREMCU_E_CLOCK_FAILURE
019033MCU_E_CLOCK_FAILUREMCU_E_CLOCK_FAILURE
019034MCU_E_CLOCK_FAILUREMCU_E_CLOCK_FAILURE
019035MCU_E_CLOCK_FAILUREMCU_E_CLOCK_FAILURE

01A

CodeDescriptionGerman
01A005Unconfirmed crashUnconfirmed Crash
01A009NVM_E_REQ_FAILEDNVM_E_REQ_FAILED
01A00BCOMM_E_NET_START_IND_CHANNEL_0COMM_E_NET_START_IND_CHANNEL_0
01A011WDGM_E_ALIVE_SUPERVISIONWDGM_E_ALIVE_SUPERVISION
01A012DEM_INT_ERMA_RESETDEM_INT_ERMA_RESET
01A014FRIF_E_JLE_SYNCFRIF_E_JLE_SYNC
01A018FLS_E_ERASE_FAILEDFLS_E_ERASE_FAILED
01A019FLS_E_WRITE_FAILEDFLS_E_WRITE_FAILED
01A01AFLS_E_READ_FAILEDFLS_E_READ_FAILED
01A01CIPDUM_E_TRANSMIT_FAILEDIPDUM_E_TRANSMIT_FAILED
01A023NVM_E_INTEGRITY_FAILEDNVM_E_INTEGRITY_FAILED
01A02CWDGM_E_SET_MODEWDGM_E_SET_MODE
01A031DM_EVENT_ZEITBOTSCHAFTTIMEOUTDM_EVENT_ZEITBOTSCHAFTTIMEOUT
01A033DEM_INT_RAM_SINGLE_BITDEM_INT_RAM_SINGLE_BIT
01A034DEM_INT_ROM_CODE_SINGLE_BITDEM_INT_ROM_CODE_SINGLE_BIT
01A035DEM_INT_ROM_CODE_MULTI_BITDEM_INT_ROM_CODE_MULTI_BIT
01A036DEM_INT_RAM_3_REBOOTDEM_INT_RAM_3_REBOOT
01A038DEM_INT_RAM_REBOOTDEM_INT_RAM_REBOOT
01A039DEM_INT_DATA_MULTI_BITDEM_INT_DATA_MULTI_BIT
01A03ADEM_INT_DATA_SINGLE_BITDEM_INT_DATA_SINGLE_BIT
01A040VSM_EVENT_VEHICLESTATEVSM_EVENT_VEHICLESTATE
01A041MCU_E_QUARTZ_FAILUREMCU_E_QUARTZ_FAILURE
01A050MCU_E_TIMEOUT_TRANSITIONMCU_E_TIMEOUT_TRANSITION
01A054WDG_E_MISS_TRIGGERWDG_E_MISS_TRIGGER
01A060EDR_CRC_MISMATCHEDR_CRC_MISMATCH
01A061AECU_DEVELOPPER_MODEAECU_DEVELOPPER_MODE
01A062DEM_INT_AECU_ASYNCHRON_MODEDEM_INT_AECU_ASYNCHRON_MODE
01A063DEM_INT_CAF1_CONFIG_EXT_SENSORDEM_INT_CAF1_CONFIG_EXT_SENSOR
01A064DEM_INT_CIM_STPS_SEATMEM_CONFIGDEM_INT_CIM_STPS_SEATMEM_CONFIG
01A401Outgoing error message buffer is fullPuffer für ausgehende Fehlermeldungen ist voll
01A402Error could not be sent after the maximum number of attemptsFehler konnte nach maximaler Anzahl von Versuchen nicht gesendet werden
01AB01DEM_INT_CALIB_PP_CRCDEM_INT_CALIB_PP_CRC
01AB02DEM_INT_AIM_CRS_CALXSUMDEM_INT_AIM_CRS_CALXSUM
01AC2DDEM_INT_SMI5XY_SENS_ALIVE_ERRDEM_INT_SMI5XY_SENS_ALIVE_ERR
01AC2EDEM_INT_SMI5XY_QUALIFIER_ERR_WZDEM_INT_SMI5XY_QUALIFIER_ERR_WZ
01AC2FDEM_INT_SMI5XY_QUALIFIER_ERR_AXDEM_INT_SMI5XY_QUALIFIER_ERR_AX
01AC30DEM_INT_SMI5XY_QUALIFIER_ERR_AYDEM_INT_SMI5XY_QUALIFIER_ERR_AY
01AC31DEM_INT_SMI5XY_YR_DETDEM_INT_SMI5XY_YR_DET
01AC32DEM_INT_SMI5XY_YR_DRVDEM_INT_SMI5XY_YR_DRV
01AC33DEM_INT_SMI5XY_STARTUPDEM_INT_SMI5XY_STARTUP
01AC34DEM_INT_SMI5XY_PWRN_MXDEM_INT_SMI5XY_PWRN_MX
01AC35DEM_INT_SMI5XY_TEMPDEM_INT_SMI5XY_TEMP
01AC36DEM_INT_SMI5XY_OVERVOLTAGEDEM_INT_SMI5XY_OVERVOLTAGE
01AC37DEM_INT_SMI5XY_RATEDEM_INT_SMI5XY_RATE
01AC38DEM_INT_SMI5XY_CLK_DETDEM_INT_SMI5XY_CLK_DET
01AC39DEM_INT_SMI5XY_ACC_1DEM_INT_SMI5XY_ACC_1
01AC3ADEM_INT_SMI5XY_ACC_2DEM_INT_SMI5XY_ACC_2
01AC3BDEM_INT_SMI5XY_BITE_FAILDEM_INT_SMI5XY_BITE_FAIL
01AC3DDEM_INT_SMI5XY_SPI_RXDEM_INT_SMI5XY_SPI_RX
01AC3EDEM_INT_SMI5XY_SPI_TXDEM_INT_SMI5XY_SPI_TX
01AC3FDEM_INT_SMI5XY_POBDEM_INT_SMI5XY_POB
01AC40DEM_INT_SMI5XY_BONDDEM_INT_SMI5XY_BOND
01AC41DEM_INT_SMI5XY_ONLDEM_INT_SMI5XY_ONL
01AC42DEM_INT_SMI5XY_PLL_LCK_TIMEDEM_INT_SMI5XY_PLL_LCK_TIME
01AC43DEM_INT_SMI5XY_BITE_TIMEOUTDEM_INT_SMI5XY_BITE_TIMEOUT
01AC45DEM_INT_PS_CAP_TOOLOWDEM_INT_PS_CAP_TOOLOW
01AC48DEM_INT_CAF1_CONFIG_ERR_PADLDEM_INT_CAF1_CONFIG_ERR_PADL
01AC49DEM_INT_CAF1_CONFIG_ERR_HALLDEM_INT_CAF1_CONFIG_ERR_HALL
01AC4ADTC_CAF1_CONFIG_ERR_SBR_CISDTC_CAF1_CONFIG_ERR_SBR_CIS
01AC4BDEM_ECU_DEV_MODEDEM_ECU_DEV_MODE
01AC60DEM_INT_CIM_FASIC_STAGEDEM_INT_CIM_FASIC_STAGE
01AC61DEM_INT_CIM_FASIC_SAFINGLOGICDEM_INT_CIM_FASIC_SAFINGLOGIC
01AC62DEM_INT_CIM_FASIC_CONFIG_HW_PLAUSDEM_INT_CIM_FASIC_CONFIG_HW_PLAUS
01AC63DEM_INT_CIM_FASIC_BMW_IDDEM_INT_CIM_FASIC_BMW_ID
01AC64DEM_INT_CIM_FASIC_MULTIIDASSIGNDEM_INT_CIM_FASIC_MULTIIDASSIGN
01AC65DEM_INT_CIM_FASIC_ROLL_ASSIGNDEM_INT_CIM_FASIC_ROLL_ASSIGN
01AC66LINSM_E_CONFIRMATION_TIMEOUTLINSM_E_CONFIRMATION_TIMEOUT
01AC67LIN_E_TIMEOUTLIN_E_TIMEOUT
01AC68DEM_INT_FET_DEFECTDEM_INT_FET_DEFECT
01AC69DEM_INT_FEN_DEFECTDEM_INT_FEN_DEFECT
01AC70DEM_INT_NVMH_CRCDEM_INT_NVMH_CRC
01AC71CANTP_E_COMMCANTP_E_COMM
01AC72DEM_INT_CAF2_CRCDEM_INT_CAF2_CRC
01AC73DEM_INT_CAF3_CRCDEM_INT_CAF3_CRC
01AC80DEM_INT_DATA_ROM_INCONSISTDEM_INT_DATA_ROM_INCONSIST
01AC82DEM_INT_DATA_INCONSISTDEM_INT_DATA_INCONSIST
01AC83DEM_INT_MM_SW_INTERNALDEM_INT_MM_SW_INTERNAL
01AC84DEM_INT_SELFTESTDEM_INT_SELFTEST
01AC86SafetyMicro config plausibility faultSafetyMicro config plausibility fault
01AC87DEM_INT_NVMH_HWCONFIG_CRCDEM_INT_NVMH_HWCONFIG_CRC
01AC88DEM_INT_NVMH_CRITICAL_CRCDEM_INT_NVMH_CRITICAL_CRC
01AFFDCOMM_E_NET_START_IND_CHANNEL_1COMM_E_NET_START_IND_CHANNEL_1
01AFFFLINIF_E_NC_NO_RESPONSELINIF_E_NC_NO_RESPONSE

01B

CodeDescriptionGerman
01B000DEM_INT_MESQ_1XUNDERSENSITIVEDEM_INT_MESQ_1XUNDERSENSITIVE
01B001DEM_INT_MESQ_1XOVERSENSITIVEDEM_INT_MESQ_1XOVERSENSITIVE
01B002DEM_INT_MESQ_1XOFFSETDEM_INT_MESQ_1XOFFSET
01B003DEM_INT_MESQ_1XTIMEOUTDEM_INT_MESQ_1XTIMEOUT
01B004DEM_INT_MESQ_1YUNDERSENSITIVEDEM_INT_MESQ_1YUNDERSENSITIVE
01B005DEM_INT_MESQ_1YOVERSENSITIVEDEM_INT_MESQ_1YOVERSENSITIVE
01B006DEM_INT_MESQ_1YTIMEOUTDEM_INT_MESQ_1YTIMEOUT
01B007DEM_INT_MESQ1_SPI_PARITYDEM_INT_MESQ1_SPI_PARITY
01B008DEM_INT_MESQ1_SPIDEM_INT_MESQ1_SPI
01B009DEM_INT_MESQ1_INTERNALDEM_INT_MESQ1_INTERNAL
01B00ADEM_INT_MESQ1_SPI_DRIVERDEM_INT_MESQ1_SPI_DRIVER
01B00BDEM_INT_MESQ1_STATUSDEM_INT_MESQ1_STATUS
01B00CDEM_INT_MESQ1_OSCILLATORDEM_INT_MESQ1_OSCILLATOR
01B00DDEM_INT_MESQ1_X_OVERRANGEDEM_INT_MESQ1_X_OVERRANGE
01B00FDEM_INT_MESQ1_REG_LOCKDEM_INT_MESQ1_REG_LOCK
01B010DEM_INT_MESQ1_WRONG_PNDEM_INT_MESQ1_WRONG_PN
01B011DEM_INT_MESQ1_Y_OVERRANGEDEM_INT_MESQ1_Y_OVERRANGE
01B012DEM_INT_MESQ1_Y_INVALID_DATADEM_INT_MESQ1_Y_INVALID_DATA
01B013DEM_INT_MESQ_1YOFFSETDEM_INT_MESQ_1YOFFSET
01B014DEM_INT_MESQ1_X_INVALID_DATADEM_INT_MESQ1_X_INVALID_DATA
01B020DEM_INT_AIM_1XRAILDEM_INT_AIM_1XRAIL
01B021DEM_INT_AIM_FRONT_CALXSUMDEM_INT_AIM_FRONT_CALXSUM
01B022DEM_INT_AIM_FRONT_VERSIONDEM_INT_AIM_FRONT_VERSION
01B024DEM_INT_AIM_1YRAILDEM_INT_AIM_1YRAIL
01B025DEM_INT_AIM_SIDE_CALXSUMDEM_INT_AIM_SIDE_CALXSUM
01B026DEM_INT_AIM_SIDE_VERSIONDEM_INT_AIM_SIDE_VERSION
01B027DEM_INT_AIM_1RRAILDEM_INT_AIM_1RRAIL
01B028DEM_INT_AIM_ROLL_CALXSUMDEM_INT_AIM_ROLL_CALXSUM
01B029DEM_INT_AIM_ROLL_VERSIONDEM_INT_AIM_ROLL_VERSION
01B02ADEM_INT_AIM_1ZRAILDEM_INT_AIM_1ZRAIL
01B02BDEM_INT_AIM_DR_LINE_FAULTDEM_INT_AIM_DR_LINE_FAULT
01B02CDEM_INT_AIM_FIREMASK_INCONSISTDEM_INT_AIM_FIREMASK_INCONSIST
01B040DEM_INT_SINIT_1RUNDERSENSITIVEDEM_INT_SINIT_1RUNDERSENSITIVE
01B041DEM_INT_SINIT_1ROVERSENSITIVEDEM_INT_SINIT_1ROVERSENSITIVE
01B042DEM_INT_SINIT_1ROFFSETDEM_INT_SINIT_1ROFFSET
01B043DEM_INT_SINIT_1RTIMEOUTDEM_INT_SINIT_1RTIMEOUT
01B044DEM_INT_SINIT_1ZUNDERSENSITIVEDEM_INT_SINIT_1ZUNDERSENSITIVE
01B045DEM_INT_SINIT_1ZOVERSENSITIVEDEM_INT_SINIT_1ZOVERSENSITIVE
01B046DEM_INT_SINIT_1ZOFFSETDEM_INT_SINIT_1ZOFFSET
01B047DEM_INT_SINIT_1ZTIMEOUTDEM_INT_SINIT_1ZTIMEOUT
01B048DEM_INT_SINIT_1R_STATUS_PINDEM_INT_SINIT_1R_STATUS_PIN
01B049DEM_INT_SINIT_1Z_STATUS_PINDEM_INT_SINIT_1Z_STATUS_PIN
01B060DEM_INT_SM_COMPATIBILITYDEM_INT_SM_COMPATIBILITY
01B061DEM_INT_SM_CMD_RESP_MISMATCHDEM_INT_SM_CMD_RESP_MISMATCH
01B062DEM_INT_SM_COMFAULTDEM_INT_SM_COMFAULT
01B063DEM_INT_SM_MODE_MISMATCHDEM_INT_SM_MODE_MISMATCH
01B064DEM_INT_SM_ADCDEM_INT_SM_ADC
01B065DEM_INT_SM_CUST_CONFIGDEM_INT_SM_CUST_CONFIG
01B066DEM_INT_SM_OSC_NOTTRIMMEDDEM_INT_SM_OSC_NOTTRIMMED
01B067DEM_INT_SM_SPI_FAULTDEM_INT_SM_SPI_FAULT
01B068DEM_INT_SM_TRW_CONFIGDEM_INT_SM_TRW_CONFIG
01B069DEM_INT_SM_RESETDEM_INT_SM_RESET
01B06ADEM_INT_SM_WDDEM_INT_SM_WD
01B06BDEM_INT_SM_X_SENSORDEM_INT_SM_X_SENSOR
01B06CDEM_INT_SM_Y_SENSORDEM_INT_SM_Y_SENSOR
01B06DDEM_INT_SM_ROLL_SENSORDEM_INT_SM_ROLL_SENSOR
01B06FDEM_INT_SM_CAL_FAULTDEM_INT_SM_CAL_FAULT
01B070DEM_INT_SM_SW_INTERNALDEM_INT_SM_SW_INTERNAL
01B071DEM_INT_SM_SYNC_FAULTDEM_INT_SM_SYNC_FAULT
01B080DEM_INT_PS_VUP_TOOLOWDEM_INT_PS_VUP_TOOLOW
01B081DEM_INT_PMON_VSATDEM_INT_PMON_VSAT
01B090DEM_INT_PSH_SPIDEM_INT_PSH_SPI
01B091DEM_INT_PSH_GPSO_OFFSETDEM_INT_PSH_GPSO_OFFSET
01B092DEM_INT_PSH_GPSO_RREFDEM_INT_PSH_GPSO_RREF
01B093DEM_INT_PSH_GPSO_RANGEDEM_INT_PSH_GPSO_RANGE
01B0A0DEM_INT_FASIC_WRONG_TYPEDEM_INT_FASIC_WRONG_TYPE
01B0A1DEM_INT_FASIC_WRONG_FIRE_VOLTADEM_INT_FASIC_WRONG_FIRE_VOLTA
01B0A2DEM_INT_FASIC_INTERNAL_FETDEM_INT_FASIC_INTERNAL_FET
01B0A3DEM_INT_FASIC_SPI_COMMDEM_INT_FASIC_SPI_COMM
01B0A4DEM_INT_FASIC_UNEXPECTEDDEM_INT_FASIC_UNEXPECTED
01B0A5DEM_INT_FASIC_INTERNALDEM_INT_FASIC_INTERNAL
01B0A6DEM_INT_FASIC_MAXTESTDEPLOYDEM_INT_FASIC_MAXTESTDEPLOY
01B0FDDEM_INT_ICC_REQUEST_FAILEDDEM_INT_ICC_REQUEST_FAILED
01B0FEDEM_INT_RSCI_SPI_COMMDEM_INT_RSCI_SPI_COMM
01B0FFDEM_INT_SAT_SPIDEM_INT_SAT_SPI
01B100DEM_EKP_ShorttoVbatDEM_EKP_ShorttoVbat
01B101EKP deactivation signalEKP Deactivation Signal
01B102DEM_INT_WDGTST_TESTFAILUREDEM_INT_WDGTST_TESTFAILURE
01B103DEM_INT_PS_VUP_TOOHIGHDEM_INT_PS_VUP_TOOHIGH
01B6DESPI_E_TIMEOUTSPI_E_TIMEOUT
01B6DFSPI_E_SEQ_FAILEDSPI_E_SEQ_FAILED

Other blocks

Makes that use these codes

Code descriptions are shown in their source language; records without a translation stay raw. Source: CarCoding fault code database.

Get CarCoding

Connect your ELM327 adapter, read fault codes, and browse module settings on supported vehicles.

The app is free to download.