BMW · Mini · Rolls-Royce — 61 ile başlayan arıza kodları

BMW · Mini · Rolls-Royce araçlarında 61 ile başlayan 138 arıza kodu ve açıklaması: 610002, 610003, 610004 ve diğerleri. Kodu arayın, anlamını okuyun.

Arıza kodu
138
Blok
61
Marka grubu
BMW · Mini · Rolls-Royce
Kaynak dili
İngilizce · Almanca

BMW · Mini · Rolls-Royce arıza kodlarından 61 ile başlayan 138 tanesi, açıklamalarıyla birlikte.

KodAçıklamaAlmanca
610002Outgoing error message buffer is fullPuffer für ausgehende Fehlermeldungen ist voll
610003Error could not be sent after the maximum number of attemptsFehler konnte nach maximaler Anzahl von Versuchen nicht gesendet werden
610004Invalid signal in CAN message RELATIVE TIMEUngültiges Signal in CAN-Botschaft RELATIVZEIT
610005Message (vehicle status, 0x3A0) is missingBotschaft (Fahrzeugzustand, 0x3A0) fehlt
610006CANIF_E_FULL_TX_BUFFERCANIF_E_FULL_TX_BUFFER
610007CANIF_E_STOPPEDCANIF_E_STOPPED
610008CANNM_E_CANIF_TRANSMIT_ERRORCANNM_E_CANIF_TRANSMIT_ERROR
610009CAN NM timeoutCAN NM Zeitüberschreitung
61000ACANNM_E_INIT_FAILEDCANNM_E_INIT_FAILED
61000BCANTP_E_COMMCANTP_E_COMM
61000CCAN transceiver invalid statusCAN Transceiver ungültiger Zustand
61000DCAN TP operation not supportedCAN TP Operation nicht unterstützt
61000ECAN_E_TIMEOUTCAN_E_TIMEOUT
61000FStart transmission on channel 0 failedStart Übertragung auf Kanal 0 fehlgeschlagen
610010Stop transmission on channel 0 failedStop Übertragung auf Kanal 0 fehlgeschlagen
610011COMM_E_NET_START_IND_CHANNEL_0COMM_E_NET_START_IND_CHANNEL_0
610012ECUM_E_ALL_RUN_REQUESTS_KILLEDECUM_E_ALL_RUN_REQUESTS_KILLED
610013EEPROM maximum number of write cycles reachedEEPROM maximale Anzahl Schreibzyklen erreicht
610014Invalid post-build data detectedUngültige Post-Build Daten erkannt
610015WDG_E_DISABLE_REJECTEDWDG_E_DISABLE_REJECTED
610016WDGM_E_SET_MODEWDGM_E_SET_MODE
610017RAM test failedRAM Test fehlgeschlagen
610018No EEPROM sector availableKein EEPROM Sektor verfügbar
610019NVM_E_INTEGRITY_FAILEDNVM_E_INTEGRITY_FAILED
61001ANVM_E_REQ_FAILEDNVM_E_REQ_FAILED
61001BMCU_E_CLOCK_FAILUREMCU_E_CLOCK_FAILURE
61001CWDGM_E_ALIVE_SUPERVISIONWDGM_E_ALIVE_SUPERVISION
61001DIPDUM_E_TRANSMIT_FAILEDIPDUM_E_TRANSMIT_FAILED
61001ECAN interface - DLC invalidCAN-Interface - DLC ungültig
61001FWrong NGTP keytableFalsche NGTP Keytable
610020SMS send timeoutSMS Sende Timeout
610021Backup battery: short circuit to 12 voltsBackup-Batterie: Kurzschluss nach 12 Volt
610022Backup battery: short circuit to groundBackup-Batterie: Kurzschluss nach Masse
610023Backup battery: interruptionBackup-Batterie: Unterbrechung
610025Backup battery: End of lifeBackup-Batterie: End of life
610026EEPROM communication errorEEPROM Kommunikationsfehler
610028RAM test failedRAM Test fehlgeschlagen
610029CAN interface - DLC invalidCAN-Interface - DLC ungültig
61002ACAN message CON_VEH timed outZeitüberschreitung CAN-Botschaft CON_VEH
61002BInvalid signal in CAN message CON_VEHUngültiges Signal in CAN-Botschaft CON_VEH
61002CInvalid signal in CAN message DWA_ALARMUngültiges Signal in CAN-Botschaft DWA_ALARM
61002DInvalid signal in CAN message TELM_FN_TRUngültiges Signal in CAN-Botschaft TELM_FN_TR
61002EInvalid signal in CAN message TS_CALL_TRUngültiges Signal in CAN-Botschaft TS_CALL_TR
61002FInvalid signal in CAN message TS_TR_STUngültiges Signal in CAN-Botschaft TS_TR_ST
610030TELD activeTELD aktiv
610031Control unit reset counterSteuergeräte-Reset Zähler
610032NAD reset counterNAD-Reset Zähler
610033Shutdown due to excess temperature in NAO modeAbschaltung wegen Übertemperatur im NAO-Mode
610034Close shutdown due to excess temperatureNahe Abschaltung wegen Übertemperatur
610035Power reduction due to high temperatureLeistungsreduzierung wegen hoher Temperatur
610036Flight mode due to failed network registrationFlight Mode aufgrund fehlgeschlagener Netzwerk-Registrierung
610037ETHERNET_AUTO_CONFIGURATIONETHERNET_AUTO_CONFIGURATION
610038Internal voltage error 4V5Interner Spannungsfehler 4V5
610039Internal voltage error 3V8Interner Spannungsfehler 3V8
61003AInternal voltage error 5V0Interner Spannungsfehler 5V0
61003BIncorrect reference voltage 2.5 voltsFehlerhafte Referenzspannung 2,5 Volt
610040RAM memory errorRAM Memory Fehler
610041NAD software crash (core dumps)NAD Softwareabsturz (Coredumps)
6101NKFC_CANNKFC_CAN
6102NKFC_CCUNKFC_CCU
6103NKFC_EEPROMNRNKFC_EEPROMNR
6104NKFC_USNKFC_US
6105NKFC_EPROMNKFC_EPROM
6106NKFC_IWDNKFC_IWD
6107NKFC_COMPNKFC_COMP
6108NKFC_RAMNKFC_RAM
6109NKFC_RELAISNKFC_RELAIS
610ANKFC_SMCURRNKFC_SMCURR
610BNKFC_SMPOSNKFC_SMPOS
610CNKFC_SMVOLTNKFC_SMVOLT
610DError code 1: CANFehler Code 1: CAN
610EError Code 2: TemperatureFehler Code 2: Temperatur
610FError code 3: EEPROM, no riskFehler Code 3: EEPROM, no risk
6110Error code 4: Sensor supplyFehler Code 4: Sensorversorgung
6111Error code 5: ROM checksumFehler Code 5: ROM Checksumme
6112Error Code 6: IgnitionFehler Code 6: Zündung
6113Error code 7: Smart watchdogFehler Code 7: Intelligenter watchdog
6114Error code 8: compareFehler Code 8: compare
6115Error code 9: RAMFehler Code 9: RAM
6116Error Code 10: RelayFehler Code 10: Relais
6117Error code 11: internal voltageFehler Code 11: interne Spannung
6118Error code 12: Control servomotorFehler Code 12: Regelung Servomotor
6119Error code 13: Speed servomotorFehler Code 13: Drehzahl Servomotor
611AError code 14: Phase voltage servomotorFehler Code 14: Phasenspannung Servomotor
611BError code 15: Steering angleFehler Code 15: Lenkwinkel
611CError code 16: steering torqueFehler Code 16: Lenkmoment
611DError code 17: Supply voltageFehler Code 17: Versorgungsspannung
611EError code 18: Vehicle speedFehler Code 18: Fahrzeuggeschwindigkeit
611FError Code 19: ProgramFehler Code 19: Programm
6120Error code 20: Sport button displayFehler Code 20: Sporttaster Anzeige
6121Error code 21: Vehicle engine speedFehler Code 21: Fahrzeugmotordrehzahl
6122Error Code 22: EEPROM, high riskFehler Code 22: EEPROM, high risk
6123Error code 23: Module motor controlFehler Code 23: Modul Motorregelung
6124NKFC_DEBUG_ACTIVENKFC_DEBUG_ACTIVE
6125NKFC_SELFLOCKNKFC_SELFLOCK
6126NKFC_CANA_WHEELSPEEDNKFC_CANA_WHEELSPEED
6127NKFC_LOWVOLTNKFC_LOWVOLT
6128Error code 28: Vehicle speed test condition not metFehler Code 28: Fahrzeuggeschwindigkeit Testbedingung nicht erfüllt
6129Error Code 29: Vehicle engine speed test condition not metFehler Code 29: Fahrzeugmotordrehzahl Testbedingung nicht erfüllt
612AError Code 30: MileageFehler Code 30: Kilometerstand
612BError Code 31: Sport switch signalFehler Code 31: Sportschaltersignal
612CHardware error control unitHardwarefehler Steuergerät
612DYaw moment compensation errorGiermomentenkompensations Fehler
612EVIN comparisonFahrgestellnummernvergleich
612FCodierdatenfehlerCodierdatenfehler
6130Boot or flash error MPCBoot- oder Flashfehler MPC
6131Flash operation or error NECFlashvorgang oder Flashfehler NEC
6132no 2 processor SZL found or installedkein 2 Prozessor SZL gefunden oder verbaut
6133motor voltageMotorspannung
6134motor currentMotorstrom
6135SZL newly installed or reconciledSZL neu verbaut oder neu abgeglichen
6136Sensor supply Motor position and positionSensorversorgung Motorlage und -position
6137Motor position sensorMotorlagesensor
6138Motor over temperatureMotor-uebertemperatur
6139Vehicle ref. Speed or direction uncertain or not availableFzg Ref. Geschw. oder Fahrtrichtung unsicher oder nicht verfuegbar
613ASupply voltage Kl. 30 (<7.5 Volt)Versorgungsspannung Kl. 30 (< 7.5 Volt)
613Bdriving dynamics sensorsFahrdynamiksensoren
613CAngle sums relationship incorrectWinkelsummenbeziehung fehlerhaft
613Delec. lock errorelektr. Sperrenfehler
613Emechanical lock errormechanischer Sperrenfehler
613FPlausibility steering angle wheel (total steering angle)Plausibilitaet Lenkwinkel-Rad (Summenlenkwinkel)
6140Redundancy comparison driver's steering angle aboveRedundanzvergleich Fahrerlenkwinkel oben
6141MotordynamikueberwachungMotordynamikueberwachung
6142ECO-valveECO-Ventil
6143ServovalveSERVO-Ventil
6144SelbsthemmungsueberwachungSelbsthemmungsueberwachung
6145no monitoring of the angle sum relationshipkeine Ueberwachung der Winkelsummenbeziehung
6146Engine temperature sensorMotortemperatursensor
6147Sensor supply steering angle wheel (total steering angle)Sensorversorgung Lenkwinkel-Rad (Summenlenkwinkel)
6148Overvoltage terminal 30 (> 17 volts)Ueberspannung Klemme 30 (> 17 Volt)
6149combined position - speed monitoringkombinierte Lage- Drehzahlueberwachung
614AMotor position angle not initializedMotorlagewinkel nicht initialisiert
614BERCOSEK errorERCOSEK Fehler
619400VSM_EVENT_VEHICLESTATEVSM_EVENT_VEHICLESTATE
61A000ECALL_ASSIST_DISABLEDECALL_ASSIST_DISABLED
61A001ECALL_ASSIST_NOT_AVAILABLEECALL_ASSIST_NOT_AVAILABLE
61A002ECALL_TRIGGEREDECALL_TRIGGERED
61A003SIM card not unlockedSIM-Karte nicht freigeschaltet

Diğer bloklar

Bu kodları kullanan markalar

Kod metinleri kaynak dilinde gösterilir; çevirisi olmayan kayıt ham kalır. Kaynak: CarCoding arıza kodu veritabanı.

CarCoding'i indirin

ELM327 adaptörünüzle bağlanın, arıza kodlarını okuyun, desteklenen araçlarda modül ayarlarını görün.

Uygulama ücretsiz indirilir.